program: Gaussian 16
title: 2F_isomer_10 opt
version: ES64L-G16RevC.02
basis: CBSB1
frameworkgroup: C1[X(C10H6F2)]
method: RHF
basis: STO-3G
operation: FOpt
keyword: #P
keyword: opt
keyword: EmpiricalDispersion=GD3BJ
keyword: integral(grid=ultrafinegrid)
keyword: GFInput
keyword: pop=full
keyword: IOP(3/74=-78)
keyword: IOP(6/7=3)
keyword: IOP(3/5=10)
keyword: IOP(3/175=01217700)
keyword: IOP(3/177=414500)
keyword: IOP(3/178=4859300)
keyword: SCF=YQC
title: #P opt EmpiricalDispersion=GD3BJ integral(grid=ultrafinegrid) GFInput
nucrepener: 645.9552701913
basis: NPDir=0 NMtPBC= 1 NCelOv= 1 NCel= 1 NClECP= 1 NCelD= 1
basis: NCelK= 1 NCelE2= 1 NClLst= 1 CellRange= 0.0.
basis: One-electron integrals computed using PRISM.
basis: One-electron integral symmetry used in STVInt
basis: NBasis= 444 RedAO= T EigKep= 1.51D-06 NBF= 444
basis: NBsUse= 442 1.00D-06 EigRej= 6.09D-07 NBFU= 442
converged: YES YES YES YES
title: Mulliken charges:
elementType: C C C C C C C C C C F F H H H H H H
charge: 0.523251 -0.268731 -0.425485 -0.001370 -0.241604 -0.208073 0.304789 0.011627 0.142415 -0.074075 -0.249775 -0.230012 0.101399 0.123317 0.100759 0.152757 0.120131 0.118680
chargesum: 0.00000
charge: 0.501155 -0.246402 -0.426197 -0.046859 -0.279768 -0.204064 0.317935 0.040068 0.184892 -0.059298 -0.250385 -0.227654 0.097153 0.120209 0.095343 0.149572 0.117077 0.117222
chargesum: -0.00000
dipole: -2.1615 1.6880 0.0000
dipole: 2.7425
quadrupole: -64.8395 -60.6517 -70.7825
quadrupole: 3.8646 -0.0000 0.0000
quadrupole: 0.5851 4.7728 -5.3579 3.8646 -0.0000 0.0000
hfenergy: -583.6076747 hartree
pointgroup: C01 [X(C10H6F2)]
dipole: 0.8949827 -0.5998711 -0.0581665 debye
InChI: InChI=1/10C.2F.6H
charge 0 multiplicity 1
18 atoms
C  -0.21107058 0.64957054 0.0483365
C  0.25338469 -0.67952619 -0.05119535
C  -0.67735734 -1.73420455 -0.10506841
C  0.71116458 1.71091268 0.10282807
C  -1.5968676 0.86611729 0.08987044
C  1.64269817 -0.9027875 -0.09325486
C  -2.01193551 -1.48683449 -0.06242434
C  2.04535529 1.45487772 0.05960113
C  -2.4685262 -0.17078762 0.03606617
C  2.51728491 0.13580303 -0.03939233
F  -2.05270443 2.10142907 0.18284576
F  -3.76764889 0.05905197 0.07683128
H  -0.31675007 -2.74830619 -0.18113135
H  0.34359359 2.72125409 0.17876965
H  2.00148282 -1.91840661 -0.16938622
H  -2.74171905 -2.27959665 -0.10233553
H  2.75003035 2.27080024 0.10157597
H  3.57958326 -0.04936482 -0.07253656
