program: Gaussian 16
title: 2F_isomer_12 opt
version: ES64L-G16RevC.02
basis: CBSB1
frameworkgroup: C1[X(C10H6F2)]
method: RHF
basis: STO-3G
operation: FOpt
keyword: #P
keyword: opt
keyword: EmpiricalDispersion=GD3BJ
keyword: integral(grid=ultrafinegrid)
keyword: GFInput
keyword: pop=full
keyword: IOP(3/74=-78)
keyword: IOP(6/7=3)
keyword: IOP(3/5=10)
keyword: IOP(3/175=01217700)
keyword: IOP(3/177=414500)
keyword: IOP(3/178=4859300)
keyword: SCF=YQC
title: #P opt EmpiricalDispersion=GD3BJ integral(grid=ultrafinegrid) GFInput
nucrepener: 646.7751533949
basis: NPDir=0 NMtPBC= 1 NCelOv= 1 NCel= 1 NClECP= 1 NCelD= 1
basis: NCelK= 1 NCelE2= 1 NClLst= 1 CellRange= 0.0.
basis: One-electron integrals computed using PRISM.
basis: One-electron integral symmetry used in STVInt
basis: NBasis= 444 RedAO= T EigKep= 1.49D-06 NBF= 444
basis: NBsUse= 442 1.00D-06 EigRej= 5.51D-07 NBFU= 442
converged: YES YES YES YES
title: Mulliken charges:
elementType: C C C C C C C C C C F F H H H H H H
charge: 0.014569 0.014569 -0.074420 -0.074416 -0.242741 -0.242741 0.185001 0.185004 -0.038804 -0.038804 -0.237913 -0.237913 0.121803 0.121803 0.146420 0.146420 0.126082 0.126081
chargesum: 0.00000
charge: -0.001744 -0.001744 -0.052597 -0.052597 -0.275054 -0.275054 0.144336 0.144336 0.016284 0.016284 -0.221709 -0.221709 0.122337 0.122337 0.145795 0.145795 0.122352 0.122352
chargesum: -0.00000
dipole: 0.0000 -0.0000 0.0000
dipole: 0.0000
quadrupole: -63.6448 -61.5796 -70.7955
quadrupole: -8.1190 -0.0000 0.0000
quadrupole: 1.6952 3.7604 -5.4556 -8.1190 -0.0000 0.0000
hfenergy: -583.614054 hartree
pointgroup: C01 [X(C10H6F2)]
dipole: 0. 0. 0. debye
InChI: InChI=1/10C.2F.6H
charge 0 multiplicity 1
18 atoms
C  -0.03665978 -0.7045704 -0.00872699
C  0.03665997 0.70457043 0.00872643
C  -1.1744579 1.40391396 -0.12224164
C  1.17445811 -1.40391394 0.1222405
C  -1.27686952 -1.35221647 -0.15178972
C  1.27686964 1.35221647 0.15178954
C  -2.36957898 0.78502899 -0.26006786
C  2.36957912 -0.78502898 0.26006751
C  -2.41351661 -0.61761942 -0.27418962
C  2.41351668 0.6176194 0.27419004
F  1.12181501 -2.7279578 0.10765955
F  -1.12181496 2.72795781 -0.10765874
H  1.30920781 2.42884494 0.16247431
H  -1.30920762 -2.42884494 -0.16247451
H  -3.26513321 1.37721941 -0.35641769
H  3.26513326 -1.37721945 0.35641794
H  3.36610402 1.11139283 0.38405016
H  -3.36610402 -1.11139284 -0.38404922
