program: Gaussian 16
title: 4F_isomer_41 opt
version: ES64L-G16RevC.02
basis: CBSB1
frameworkgroup: C1[X(C10H4F4)]
method: RHF
basis: STO-3G
operation: FOpt
keyword: #P
keyword: opt
keyword: EmpiricalDispersion=GD3BJ
keyword: integral(grid=ultrafinegrid)
keyword: GFInput
keyword: pop=full
keyword: IOP(3/74=-78)
keyword: IOP(6/7=3)
keyword: IOP(3/5=10)
keyword: IOP(3/175=01217700)
keyword: IOP(3/177=414500)
keyword: IOP(3/178=4859300)
keyword: SCF=YQC
title: #P opt EmpiricalDispersion=GD3BJ integral(grid=ultrafinegrid) GFInput
nucrepener: 845.8212992458
basis: NPDir=0 NMtPBC= 1 NCelOv= 1 NCel= 1 NClECP= 1 NCelD= 1
basis: NCelK= 1 NCelE2= 1 NClLst= 1 CellRange= 0.0.
basis: One-electron integrals computed using PRISM.
basis: One-electron integral symmetry used in STVInt
basis: NBasis= 500 RedAO= T EigKep= 1.47D-06 NBF= 500
basis: NBsUse= 498 1.00D-06 EigRej= 6.86D-07 NBFU= 498
converged: YES YES YES YES
title: Mulliken charges:
elementType: C C C C C C C C C C F F F F H H H H
charge: 0.077201 0.077209 -0.067213 -0.067214 -0.179035 -0.179031 0.543935 0.543938 -0.241812 -0.241815 -0.234057 -0.234057 -0.219767 -0.219767 0.139547 0.139548 0.181195 0.181195
chargesum: 0.00000
charge: 0.117915 0.117915 -0.012616 -0.012616 -0.295584 -0.295584 0.504154 0.504154 -0.207975 -0.207975 -0.217994 -0.217994 -0.206370 -0.206370 0.139637 0.139637 0.178832 0.178832
chargesum: -0.00000
dipole: 0.0000 -0.0000 0.0000
dipole: 0.0000
quadrupole: -78.5094 -77.1558 -77.3630
quadrupole: 4.4899 0.0000 -0.0000
quadrupole: -0.8333 0.5202 0.3131 4.4899 0.0000 -0.0000
hfenergy: -781.9030658 hartree
pointgroup: C01 [X(C10H4F4)]
dipole: 0. 0. 0.0000005 debye
InChI: InChI=1/10C.4F.4H
charge 0 multiplicity 1
18 atoms
C  -0.05660051 0.70160131 0.03344908
C  0.05660027 -0.70160125 -0.0334479
C  -1.13493596 -1.42196235 -0.22283263
C  1.13493566 1.42196238 0.22283421
C  -1.30507989 1.33726886 -0.0847813
C  1.30507966 -1.3372688 0.08478222
C  -2.34461645 -0.82753522 -0.33862794
C  2.34461632 0.82753531 0.33862818
C  -2.40152528 0.56717069 -0.26523861
C  2.40152517 -0.56717059 0.26523871
F  1.052435 2.73884034 0.28855812
F  -1.05243489 -2.73884013 -0.28855967
F  -3.59258153 1.12921684 -0.38058843
F  3.59258158 -1.12921666 0.38058718
H  1.38770089 -2.40922346 0.03319877
H  -1.38770106 2.40922353 -0.03319791
H  -3.23970904 -1.4090449 -0.48322402
H  3.23970907 1.40904508 0.48322293
