program: Gaussian 09
title: 000075384
version: EM64L-G09RevD.01
frameworkgroup: C1[X(C10H10O3)]
method: RPBEPBE
basis: SDD
operation: Freq
keyword: #pfreq=noraman
keyword: PBEPBE/SDD
title: #p freq=noraman PBEPBE/SDD
converged: YES YES NO NO
title: Mulliken charges:
elementType: O O O C C C C C C C C C C H H H H H H H H H H
charge: -0.202175 -0.436183 -0.243443 0.279484 -0.456754 0.114548 0.087103 -0.366175 -0.319895 -0.687846 -0.216877 -0.221245 0.094660 0.225537 0.237863 0.264781 0.280759 0.241125 0.208736 0.247872 0.239659 0.239552 0.388914
chargesum: 0.00000
title: Mulliken charges with hydrogens summed into heavy atoms:
elementType: O O O C C C C C C C C C C
charge: -0.202175 -0.047269 -0.243443 0.279484 0.006645 0.114548 0.087103 -0.101395 -0.039136 0.009888 0.022782 0.018307 0.094660
polarizability: 1.49948675e+02 -5.39416749e+00 1.31166052e+02 7.87528421e+00 2.44931109e+00 6.61739394e+01
1716.lowfreq: -6.4200 0.0002 0.0006 0.0007 3.1849 11.0207 32.3202 67.5804 75.7939
frequency: 32.1940 67.5594 75.7897 103.7554 147.1766 181.6502 208.3378 241.1833 260.5194 287.8443 349.3373 384.5823 412.9033 482.8674 546.8129 573.0992 591.9959 598.6170 648.2294 689.0779 720.9030 754.3809 784.0290 793.3810 794.7051 897.4618 945.2890 977.2778 1004.2221 1006.0155 1026.0349 1045.7326 1066.5094 1084.2017 1112.5112 1162.8000 1179.2667 1212.6067 1234.6542 1276.0063 1321.5035 1335.4585 1380.6986 1384.5189 1426.5670 1439.4266 1468.6864 1472.5973 1488.1743 1573.3518 1593.1394 1606.2245 1631.0617 2953.5584 2997.8254 3063.0239 3095.9824 3107.8341 3137.3460 3152.0565 3165.4396 3181.4283 3530.9577
redmass: 5.9417 3.6745 4.0841 4.8940 5.0539 1.6310 2.2296 3.0250 3.6013 4.7029 5.8796 6.8654 3.2193 4.5103 4.2831 2.8280 1.3815 3.3332 4.9111 3.7813 3.4659 2.5783 3.0592 2.0794 1.5082 1.4458 3.4556 1.4050 2.7159 1.7703 2.0746 2.0551 1.6633 2.4925 1.7984 1.7340 1.0767 2.6149 1.2184 1.4931 2.6222 1.7296 9.4551 1.2137 2.1575 1.1048 1.0406 2.6037 1.0523 6.9489 7.2670 7.4533 8.4262 1.0686 1.0352 1.0898 1.1000 1.1006 1.0863 1.0911 1.0967 1.0976 1.0642
irintensity: 1.7035 0.7279 1.1498 1.2936 1.6096 1.0083 2.2884 2.9615 2.6784 1.7465 4.7163 13.6071 9.4208 7.7022 9.1581 10.8674 87.6434 50.9654 3.9882 66.8401 9.1265 47.1975 12.2414 20.4409 13.6365 0.5453 35.3390 4.7599 159.6602 71.6215 4.3889 7.6926 8.6828 28.2288 57.4915 76.4446 0.2944 76.4779 0.3045 3.9252 87.0418 39.1491 6.0524 30.4333 3.6778 24.5106 13.3107 9.4157 13.1970 29.6001 101.2312 30.9429 231.6313 16.2633 35.0042 13.0508 26.9878 22.9333 1.7595 7.7807 13.8568 9.1631 54.2156
temp: 298.150 k
press: 1.00000 atm
elementType: 8 8 8 6 6 6 6 6 6 6 6 6 6 1 1 1 1 1 1 1 1 1 1
symmnumber: 1
zpe: 463363.8 jmol-1
zpe.correction: 0.176486 hartree
zpe.thermalcorrener: 0.188812 hartree
zpe.thermalcorrenthalpy: 0.189756 hartree
zpe.thermalcorrgfe: 0.137071 hartree
zpe.sumelectzpe: -611.797615 hartree
zpe.sumelectthermal: -611.785289 hartree
zpe.sumelectthermalent: -611.784345 hartree
zpe.sumelectthermalfe: -611.837030 hartree
dipole: 3.1575 0.9558 2.6964
dipole: 4.2607
quadrupole: -71.6289 -65.3827 -80.8639
quadrupole: -4.1349 -5.2049 -4.1033
quadrupole: 0.9962 7.2425 -8.2387 -4.1349 -5.2049 -4.1033
hfenergy: -611.9741009 hartree
pointgroup: C01 [X(C10H10O3)]
dipole: -1.2559156 -0.3179567 1.0637578 debye
dipolederiv: -0.7054785 -0.1400545 0.0613081 -0.1858575 -0.4322222 0.2130522 0.0405103 0.1657984 -0.6953468 -0.4276191 -0.4221862 0.0362938 -0.3370655 -1.2453306 0.1904059 0.040836 0.2418446 -0.447966 -1.0224028 0.0210145 0.1254897 0.1247704 -0.7447466 -0.0074657 0.1109712 0.0212552 -0.3388601 -0.2882747 0.0031267 0.0060393 -0.1744963 0.1353835 0.01942 -0.0196901 -0.0252253 -0.0738384 -0.2448296 0.0018357 -0.1667048 -0.0130766 0.107463 -0.0119221 -0.1722733 0.0387899 -0.220698 1.1990855 0.2271427 0.0945793 0.2632643 0.3660176 -0.2534149 0.1795942 -0.1554488 0.8317439 -0.1870408 0.3240768 0.0020869 0.3038383 -0.4578584 0.0329159 -0.0923471 0.0127267 0.0069061 -0.2481968 0.1138376 -0.0166477 0.0669358 0.0503914 -0.0312141 0.0429854 -0.0645771 -0.1222915 -0.0574529 -0.1744789 0.0072823 0.0738128 0.091245 -0.0278125 -0.0343319 -0.0035568 -0.0967603 0.0077415 0.0106588 0.0535661 0.0359555 0.0389219 0.023988 -0.0295717 -0.0139711 0.0408718 0.1168292 -0.0772708 -0.0008269 -0.0174158 0.128349 -0.0305142 -0.0122851 -0.0267518 -0.1051958 0.1520218 0.0361975 -0.0365371 -0.0423121 -0.2316347 0.0029241 -0.0328396 0.012208 -0.1534447 1.342234 0.0126736 -0.236787 -0.1347006 1.8342864 -0.2039769 -0.2231199 -0.2313943 0.3044038 0.0500043 0.0457718 -0.0029918 0.0425437 -0.0679404 -0.0956056 0.013438 -0.0714554 0.0313068 -0.0217539 -0.0663054 0.0595755 -0.0450601 -0.0098937 0.121367 0.1120799 0.06505 0.0414095 0.0701129 -0.0737045 0.0182123 -0.0397607 -0.0151248 0.0180815 -0.0063883 0.0335836 0.1420868 0.0866491 -0.0506262 0.0110737 -0.059098 0.0230536 0.0190017 0.0287953 0.0089343 0.1555736 0.0691619 -0.0271264 0.0380879 -0.092257 -0.0115345 0.0825848 0.1004632 0.0877206 0.0408507 -0.0685032 0.0134339 -0.113641 0.0258596 0.1022873 0.0067934 -0.1586036 0.0064686 -0.08628 0.1038436 -0.0010679 -0.0047708 0.042033 -0.0633798 -0.084289 0.0286543 -0.0877328 0.0552191 0.0128786 0.0886673 -0.0032911 0.1031489 -0.0330687 0.0183595 0.0027725 0.0164502 0.152114 -0.1096892 -0.0034939 0.0252118 -0.0172385 0.0866306 0.0089104 0.0273994 0.0092835 0.1557286 0.170679 0.137878 0.0433917 0.0761765 0.348705 -0.0115894 0.0529513 -0.04 0.382467 unknown
polarizability: 150.8539762|-4.8788393|129.1505982|-4.4521012|-10.2753192|67.2840919 unknown
InChI: InChI=1S/C10H10O3/c1-2-9(11)7-5-3-4-6-8(7)10(12)13/h3-6,12H,2H2,1H3
charge 0 multiplicity 1
23 atoms
O  1.767888 1.542284 -1.228956
O  -0.656311 -2.939553 0.428224
O  1.272303 -1.834583 -0.228019
C  -0.184254 0.723862 -0.089796
C  2.183894 0.692246 1.024894
C  1.313334 0.969074 -0.201965
C  -0.784825 -0.555098 0.116074
C  -1.022822 1.860625 -0.195075
C  -2.193929 -0.664736 0.254168
C  3.64962 0.383134 0.66551
C  -2.422868 1.746113 -0.052785
C  -3.010233 0.481111 0.182744
C  0.056468 -1.780557 0.084344
H  2.129002 1.61577 1.644099
H  1.742361 -0.113554 1.635113
H  -0.564133 2.835341 -0.390807
H  -2.631084 -1.656235 0.398515
H  4.059239 1.163825 0.002552
H  4.273207 0.326889 1.575234
H  3.707108 -0.582235 0.134747
H  -3.052189 2.639352 -0.129819
H  -4.095744 0.388063 0.291387
H  -0.046333 -3.721838 0.354516
