program: Gaussian 09
title: 000004463
version: EM64L-G09RevD.01
frameworkgroup: C1[X(C15H14N4O)]
method: RPBEPBE
basis: SDD
operation: Freq
keyword: #p
keyword: freq=noraman
keyword: PBEPBE/SDD
title: #p freq=noraman PBEPBE/SDD
converged: YES YES NO NO
title: Mulliken charges:
elementType: O N N N N C C C C C C C C C C C C C C C H H H H H H H H H H H H H H
charge: -0.263147 -0.220176 -0.432037 0.013621 0.001259 -0.067468 -0.504810 -0.499760 0.051777 0.061247 0.141858 0.109184 0.359675 0.044664 -0.245419 -0.329865 -0.372675 -0.352685 -0.824605 -0.199704 0.286829 0.238225 0.230507 0.232883 0.238675 0.336925 0.280686 0.234566 0.243149 0.244210 0.242048 0.233101 0.251689 0.235570
chargesum: 0.00000
title: Mulliken charges with hydrogens summed into heavy atoms:
elementType: O N N N N C C C C C C C C C C C C C C C
charge: -0.263147 -0.220176 -0.095111 0.013621 0.001259 0.219360 -0.036078 -0.028201 0.051777 0.061247 0.141858 0.109184 0.359675 0.044664 0.035267 -0.095298 -0.129525 -0.108475 -0.097767 0.035866
polarizability: 2.58850147e+02 1.22579133e+01 2.05196803e+02 3.80929463e+00 -1.72468815e+01 1.23424439e+02
1716.lowfreq: -0.0008 -0.0007 -0.0006 3.6504 7.8076 11.0418 43.9947 58.0138 73.4026
frequency: 43.9874 57.9986 73.3947 87.2127 116.2299 124.6806 158.8405 166.9301 216.6889 225.0591 248.0720 270.3870 311.6277 324.8362 358.9978 363.3782 387.6184 431.5298 444.9829 484.3678 514.3201 533.6210 543.0296 567.8820 598.5084 600.9268 637.9899 651.8520 687.2276 738.2365 753.8056 765.2827 773.9605 782.9266 813.1673 821.9966 828.9398 833.1701 857.6507 880.5980 937.9071 947.5001 951.6159 981.1875 983.1248 993.0316 1026.6428 1040.8725 1047.3304 1060.3916 1063.9982 1080.7274 1091.2820 1098.7737 1134.1126 1157.1698 1163.0239 1205.0605 1217.7750 1242.7541 1268.9972 1281.5173 1292.7099 1322.0946 1328.9808 1350.4092 1358.8582 1395.8305 1402.6828 1416.7752 1427.1238 1434.5819 1442.0261 1462.6154 1467.7635 1471.8457 1476.4081 1538.8593 1556.6883 1577.2407 1582.5915 1608.1655 2965.6890 3044.9484 3097.2672 3100.5079 3109.3772 3129.0014 3133.1897 3148.9141 3157.8732 3159.0917 3179.5126 3200.7634 3218.7859 3496.7938
redmass: 5.3392 4.3118 4.2040 3.5512 5.4029 3.8829 2.8135 1.1114 3.9250 4.3366 4.7063 4.4503 4.1981 5.2979 7.3726 4.9390 3.8034 4.7383 4.3967 3.7888 4.5360 3.7153 4.1734 6.9041 3.5877 6.2869 4.7282 2.3538 5.5957 2.3941 1.5340 3.7031 4.5534 2.2349 1.8589 1.8552 1.2560 1.8698 4.8742 4.4573 4.1335 1.4023 1.4157 2.2776 1.3993 2.8246 3.3427 1.5493 1.2455 1.3415 2.2575 2.2286 1.5398 1.4582 1.7282 1.3872 2.3272 2.0567 1.8972 2.0431 2.0996 4.7993 3.8716 5.8181 6.4692 1.6638 2.8540 1.5331 1.7679 2.1924 2.4184 1.0898 2.3539 2.0137 1.8826 1.1818 1.1571 5.6875 6.0451 6.6770 6.3998 4.1466 1.0421 1.0933 1.0977 1.0515 1.0621 1.0900 1.0879 1.0912 1.0902 1.0981 1.0996 1.1174 1.1146 1.0744
irintensity: 2.5207 1.0413 1.4267 0.2492 2.6213 4.4405 0.6262 0.6709 0.3143 0.8887 3.0690 7.1086 3.5851 7.9680 1.8207 5.7498 3.6739 10.2196 5.0026 0.9194 1.1039 1.6411 2.6736 12.8719 2.1958 2.5954 3.5706 29.1676 1.5505 53.8325 4.6922 37.5223 9.1340 23.4302 9.3523 17.1793 28.6274 9.6433 36.6991 7.3217 7.9852 0.5727 1.0327 1.1354 1.9483 4.6347 1.1756 9.9204 39.3715 0.5724 8.1378 8.5776 3.6075 1.5557 32.9256 0.2323 5.2200 21.1224 6.9017 9.6127 18.2370 68.8452 30.2793 6.4879 15.8662 35.7852 148.6421 47.3289 184.4729 258.0541 80.1134 9.4786 65.9013 97.9069 34.3815 48.7747 82.2233 10.9731 50.6520 58.1250 145.3374 333.9847 19.9593 14.5762 16.0176 15.8716 6.4551 22.1971 8.0947 9.0356 3.6724 31.5059 18.7077 0.3104 28.8079 26.9630
temp: 298.150 k
press: 1.00000 atm
elementType: 8 7 7 7 7 6 6 6 6 6 6 6 6 6 6 6 6 6 6 6 1 1 1 1 1 1 1 1 1 1 1 1 1 1
symmnumber: 1
zpe: 694508.0 jmol-1
zpe.correction: 0.264524 hartree
zpe.thermalcorrener: 0.280912 hartree
zpe.thermalcorrenthalpy: 0.281857 hartree
zpe.thermalcorrgfe: 0.220763 hartree
zpe.sumelectzpe: -872.799728 hartree
zpe.sumelectthermal: -872.783340 hartree
zpe.sumelectthermalent: -872.782396 hartree
zpe.sumelectthermalfe: -872.843490 hartree
dipole: 2.4764 -0.5239 -0.8836
dipole: 2.6810
quadrupole: -93.7221 -120.3509 -119.7034
quadrupole: -4.5470 4.7524 6.4742
quadrupole: 17.5367 -9.0921 -8.4446 -4.5470 4.7524 6.4742
hfenergy: -873.0642522 hartree
pointgroup: C01 [X(C15H14N4O1)]
dipole: -0.9677628 -0.2603688 0.3289706 debye
polarizability: 259.9032005|-9.4508503|204.0862857|5.610557|16.9838635|123.4819038 unknown
InChI: InChI=1S/C15H14N4O/c1-9-6-8-17-14-12(9)18-15(20)11-3-2-7-16-13(11)19(14)10-4-5-10/h2-3,6-8,10,18H,4-5H2,1H3
charge 0 multiplicity 1
34 atoms
O  0.89787 -3.00497 -1.447127
N  0.294595 1.035223 -0.144149
N  -0.821565 -1.577771 -0.917374
N  -1.796639 1.592202 0.818846
N  2.420821 0.911997 0.867541
C  0.539254 2.473656 -0.280537
C  -0.106915 3.184862 -1.467507
C  1.411917 2.93146 -1.446781
C  -1.044937 0.649735 0.188578
C  1.39597 0.23253 0.26617
C  -1.565262 -0.631707 -0.160702
C  1.466728 -1.176776 0.022272
C  -2.914459 -0.943249 0.179821
C  0.515279 -1.967854 -0.818838
C  2.620421 -1.867988 0.469692
C  -3.680845 0.05339 0.830174
C  -3.090865 1.299761 1.118767
C  3.514988 0.220405 1.27977
C  -3.51652 -2.289208 -0.17396
C  3.656471 -1.17736 1.126461
H  0.618688 3.022977 0.660398
H  -0.481409 4.198599 -1.302558
H  -0.706186 2.582375 -2.156617
H  1.801023 2.163014 -2.121148
H  2.091067 3.769009 -1.267383
H  -1.361947 -2.215838 -1.511171
H  2.691501 -2.937055 0.246668
H  -4.72247 -0.141431 1.104141
H  -3.661205 2.097782 1.606426
H  4.30233 0.819491 1.752341
H  -4.514165 -2.40075 0.280772
H  -3.645842 -2.413516 -1.268469
H  -2.883618 -3.124165 0.180053
H  4.552827 -1.69133 1.48353
