program: Gaussian 09
title: 000075362
version: EM64L-G09RevD.01
frameworkgroup: C1[X(C6H15ClSi)]
method: RPBEPBE
basis: SDD
operation: Freq
keyword: #p
keyword: freq=noraman
keyword: PBEPBE/SDD
title: #p freq=noraman PBEPBE/SDD
converged: YES YES NO NO
title: Mulliken charges:
elementType: Cl Si C C C C C C H H H H H H H H H H H H H H H
charge: -0.091073 1.284411 -0.779584 -0.293375 -1.022917 -1.022360 -1.013839 -0.581529 0.219816 0.219646 0.226198 0.226109 0.233182 0.237354 0.236899 0.236842 0.237259 0.233128 0.233431 0.233480 0.235223 0.255945 0.255756
chargesum: 0.00000
title: Mulliken charges with hydrogens summed into heavy atoms:
elementType: Cl Si C C C C C C
charge: -0.091073 1.284411 -0.340122 0.158931 -0.315481 -0.315131 -0.311706 -0.069828
polarizability: 1.23412702e+02 -7.24691331e+00 9.05860555e+01 2.76696324e-02 2.15939566e-03 8.55846511e+01
1716.lowfreq: -7.9532 -4.5750 -0.0029 -0.0025 0.0015 18.2157 35.1268 72.6101 73.7219
frequency: 35.0221 72.5575 73.6763 101.8713 117.1461 129.3463 132.9149 162.7727 183.9739 190.4318 214.2051 227.3924 287.7951 355.4409 569.4989 644.9624 675.3176 692.6376 699.8858 719.6070 737.8141 769.9192 806.8417 830.9673 895.5065 900.2265 922.6506 982.3024 1011.9500 1061.3688 1082.8768 1189.4147 1247.3344 1261.4342 1290.8125 1291.2004 1299.4885 1306.5354 1326.9398 1437.4370 1443.2312 1445.7641 1447.1430 1453.1103 1456.0446 1459.1206 1461.5030 1480.1052 2962.7673 2978.1854 2978.5401 2979.8814 2997.6456 3016.9216 3045.9972 3058.1130 3079.9910 3080.3372 3081.4880 3082.8969 3083.1467 3083.2504 3130.6147
redmass: 2.9786 3.8860 1.9984 1.2005 1.5260 1.0482 1.2108 3.2427 2.2701 2.8619 2.9229 2.3142 4.3304 3.8863 4.0644 5.3694 1.8456 3.2631 1.6566 2.9641 1.1678 1.1396 1.4371 1.3320 1.4477 1.5110 1.6168 1.3958 4.7500 3.2607 1.0356 1.2752 1.3068 1.2072 1.1523 1.1935 1.1421 1.1949 1.3393 1.0787 1.0550 1.0539 1.0579 1.0865 1.0495 1.0559 1.0475 1.0923 1.0579 1.0343 1.0344 1.0343 1.0595 1.1000 1.0563 1.1036 1.0982 1.0983 1.0987 1.0978 1.0978 1.0974 1.1118
irintensity: 1.1682 0.7969 0.2278 0.3563 0.4807 0.0308 0.0915 0.4430 0.0044 2.6797 2.5752 2.4061 7.0776 5.6124 5.8533 20.0741 0.4398 19.1379 12.4073 37.0299 0.0066 13.2798 13.1692 9.0474 63.2840 74.8018 194.5307 32.4674 14.8612 11.5397 2.8668 27.6404 3.9709 32.8073 25.2826 35.2544 27.5571 14.6767 13.2782 2.8312 0.3283 0.1748 0.3345 2.6109 8.6186 16.8241 17.0920 8.5106 18.4009 20.8294 19.1234 5.0927 16.8137 9.3196 26.9315 23.3719 0.8652 1.1011 0.3592 35.3372 32.3802 48.7686 24.3515
temp: 298.150 k
press: 1.00000 atm
elementType: 17 14 6 6 6 6 6 6 1 1 1 1 1 1 1 1 1 1 1 1 1 1 1
symmnumber: 1
zpe: 509760.3 jmol-1
zpe.correction: 0.194157 hartree
zpe.thermalcorrener: 0.207396 hartree
zpe.thermalcorrenthalpy: 0.208340 hartree
zpe.thermalcorrgfe: 0.153497 hartree
zpe.sumelectzpe: -986.433696 hartree
zpe.sumelectthermal: -986.420458 hartree
zpe.sumelectthermalent: -986.419514 hartree
zpe.sumelectthermalfe: -986.474357 hartree
dipole: -2.6832 1.1741 -0.0007
dipole: 2.9288
quadrupole: -78.6078 -65.4790 -65.9343
quadrupole: 3.4242 -0.0045 0.0006
quadrupole: -8.6008 4.5280 4.0728 3.4242 -0.0045 0.0006
hfenergy: -986.6278536 hartree
pointgroup: C01 [X(C6H15Cl1Si1)]
dipole: -1.0378204 -0.4991176 -0.0397932 debye
dipolederiv: -0.7594327 -0.1253224 -0.0147877 -0.2961742 -0.2886043 -0.0091438 -0.0228991 -0.0064452 -0.1943731 1.4780529 0.0329725 0.0054465 -0.1327132 1.1960812 -0.0040182 -0.0007422 -0.0007647 1.2168297 -0.605249 -0.0036394 -0.0077551 0.1275472 -0.2069376 0.0004336 -0.0017582 -0.0034014 -0.1389143 -0.1035259 -0.0374377 -0.0044472 0.0047082 -0.0095447 -0.0061927 -0.0036294 -0.005892 0.1157912 -0.354184 0.0038009 0.0182611 0.0504681 -0.3444074 -0.0923914 0.0202329 -0.0861209 -0.414924 -0.3533403 0.0040564 -0.0174474 0.0477286 -0.3546475 0.0970648 -0.016924 0.0898625 -0.405648 -0.4681157 -0.1079696 -0.0056337 -0.0567526 -0.3637332 -0.0027568 -0.0041257 -0.003012 -0.2787791 0.8213979 0.2441042 0.0207211 0.2836561 0.336676 0.010547 0.0228916 0.0094885 0.216226 0.0715856 0.0375908 -0.0610695 -0.0192453 -0.0408111 0.1185101 -0.0250288 0.1309533 -0.0505471 0.0692382 0.0368814 0.0675707 -0.0177108 -0.021744 -0.1172579 0.0274295 -0.1275578 -0.067089 0.0677907 0.0028171 0.0134823 0.0218741 -0.0043509 -0.0947259 0.0067945 -0.1009552 -0.0600888 0.0678475 0.001161 -0.0097891 0.0196565 -0.0208869 0.0990577 -0.0015415 0.1045091 -0.0440443 0.1071116 0.0078536 -0.0211432 -0.0024039 0.0476294 0.0981683 -0.0217421 0.1105643 -0.1057393 0.0030138 -0.1291708 -0.0308692 -0.1458652 -0.0327637 -0.0173389 -0.0499286 -0.0337544 0.0946945 -0.0962567 0.1106414 0.033305 0.1283953 0.0428152 -0.0157386 0.0584108 -0.0216411 0.1009336 -0.0964693 0.1102192 -0.0326411 0.1298685 0.0433127 0.0158521 -0.0564734 0.021209 0.1002041 0.0041374 -0.1311377 0.0205777 -0.1474135 -0.0384091 0.0066047 0.0382305 0.0230034 0.099155 0.1055769 0.0098844 0.0286734 -0.0004093 0.0590449 -0.0887815 0.0292634 -0.1007676 -0.1157633 0.1143901 -0.0060102 -0.0099598 -0.001075 -0.0043942 -0.1324538 -0.0058723 -0.1259025 -0.0548187 0.1134904 -0.010324 0.0140093 -0.0052685 -0.0173783 0.1342976 0.010379 0.1274957 -0.0413992 -0.1670355 0.0738984 -0.0021754 0.0470747 0.0793511 0.0000553 -0.0024594 0.000418 0.1051982 -0.0106618 -0.0601893 -0.0076032 -0.0179629 -0.0195506 -0.0857145 0.0381589 -0.106601 -0.0464283 -0.0093621 -0.0646804 0.0032746 -0.0179828 -0.0367469 0.085923 -0.0386665 0.1053122 -0.0304759 unknown
polarizability: 122.8266445|8.3965791|91.1383654|0.9706394|0.3950805|85.6183982 unknown
InChI: InChI=1S/C6H15ClSi/c1-8(2,3)6-4-5-7/h4-6H2,1-3H3
charge 0 multiplicity 1
23 atoms
Cl 4.125443 0.498329 0.100831
Si -1.608039 0.027624 -0.014807
C  0.106013 -0.863927 -0.021837
C  1.321479 0.1014 0.034836
C  -1.775508 1.077113 1.579754
C  -1.74304 1.164686 -1.551124
C  -2.98468 -1.30424 -0.067226
C  2.635829 -0.680365 0.022285
H  0.137756 -1.562653 0.840418
H  0.164353 -1.493803 -0.934373
H  1.277711 0.721535 0.950146
H  1.303922 0.794764 -0.827245
H  -1.682888 0.448128 2.484672
H  -0.99817 1.861866 1.629539
H  -2.760391 1.578588 1.617349
H  -2.733199 1.655764 -1.588531
H  -0.975436 1.960404 -1.534528
H  -1.616967 0.589516 -2.487253
H  -2.900546 -1.928982 -0.975833
H  -2.925814 -1.972947 0.811539
H  -3.987332 -0.8378 -0.069865
H  2.775313 -1.255705 -0.906284
H  2.744093 -1.336498 0.900036
