program: Gaussian 09
title: 000075371
version: EM64L-G09RevD.01
frameworkgroup: C1[X(C18H16N2)]
method: RPBEPBE
basis: SDD
operation: Freq
keyword: #pfreq=noraman
keyword: PBEPBE/SDD
title: #p freq=noraman PBEPBE/SDD
converged: NO NO NO NO
title: Mulliken charges:
elementType: N N C C C C C C C C C C C C C C C C C C H H H H H H H H H H H H H H H H
charge: -0.383470 -0.710005 0.340555 0.351455 0.351443 -0.349570 -0.349563 -0.341128 -0.341054 -0.341019 -0.341081 -0.431551 -0.431555 0.511364 -0.221052 -0.221073 -0.221063 -0.221051 -0.237667 -0.237663 0.242279 0.242279 0.242084 0.242147 0.242118 0.242055 0.209785 0.209785 0.226088 0.226095 0.226094 0.226088 0.227978 0.227978 0.295947 0.295947
chargesum: 0.00000
title: Mulliken charges with hydrogens summed into heavy atoms:
elementType: N N C C C C C C C C C C C C C C C C C C
charge: -0.383470 -0.118111 0.340555 0.351455 0.351443 -0.107290 -0.107283 -0.099044 -0.098907 -0.098902 -0.099025 -0.221766 -0.221770 0.511364 0.005036 0.005022 0.005031 0.005038 -0.009689 -0.009685
polarizability: 2.37973334e+02 1.82478946e-04 2.28868760e+02 4.79655913e-02 8.91227146e-03 1.57770412e+02
1716.lowfreq: -51.0445 -31.3086 -0.0005 -0.0004 0.0002 6.5200 7.8981 15.3779 43.6300
frequency: -51.0153 -31.3074 43.5246 56.0191 57.5325 64.5727 119.4809 204.9452 208.2891 253.7788 263.6767 279.2577 279.9536 297.8656 326.7962 397.5589 406.2324 410.2728 411.4531 461.6620 481.7141 486.4909 508.6904 580.8793 609.1749 615.5780 620.2237 640.7390 685.6728 694.8850 703.5294 705.6052 760.8473 769.6677 798.3943 809.2092 811.6933 842.8764 850.9805 889.8229 897.1341 914.9945 926.7521 931.8267 944.5587 973.0683 977.8847 988.4356 990.3315 993.1612 993.8545 995.7183 1013.9651 1021.5409 1022.4957 1066.9119 1071.0272 1134.1769 1162.0543 1169.4021 1169.8817 1171.0323 1179.7880 1192.0191 1266.4447 1287.4497 1293.8174 1303.1371 1322.1721 1325.0849 1364.9514 1366.7991 1373.2911 1428.3366 1430.9343 1438.5591 1476.8987 1477.9187 1511.5038 1576.2442 1585.8295 1587.6421 1594.1000 1601.0726 1629.0537 1648.2895 3111.6953 3114.4439 3121.5054 3121.8160 3130.5301 3131.5906 3145.6517 3147.5384 3150.2953 3153.5976 3154.5131 3156.4209 3164.7476 3166.0443 3575.1739 3718.0004
redmass: 3.7621 4.0706 4.6536 5.1961 3.5309 5.1366 4.3983 4.3636 1.2307 5.1561 5.1136 4.3629 4.3475 1.0448 6.3699 2.9961 2.7911 2.8203 2.8563 6.0982 4.9820 3.5071 2.3890 3.7979 6.4815 5.6674 6.5991 6.6801 5.8025 1.8964 3.5115 1.7451 1.7540 2.1363 1.2604 1.7703 5.0460 1.2438 1.2421 2.5960 2.8747 1.3614 1.8748 1.3375 2.0310 1.3911 1.3780 5.9216 5.3991 2.5432 1.3374 1.4051 1.4549 2.1521 1.9048 1.5387 1.5567 1.2347 2.0724 1.0561 1.0547 1.1101 1.3595 1.1202 3.3208 2.3691 1.3813 1.3571 1.4060 7.5060 8.4770 8.7488 6.4216 2.1289 2.1575 3.4210 2.5255 2.3873 3.0140 7.1179 6.2975 6.3646 6.2014 6.0408 1.2431 4.6070 1.0890 1.0883 1.0846 1.0847 1.0886 1.0890 1.0929 1.0933 1.0933 1.0965 1.0942 1.0960 1.1011 1.1008 1.0443 1.1043
irintensity: 0.0000 0.2290 1.9560 0.4625 0.0001 0.4128 4.6713 0.1586 316.1617 0.2778 0.0213 7.0853 0.0281 0.0072 0.8260 0.3691 0.0000 0.0003 0.0132 11.7685 2.2736 6.4381 10.0418 39.4319 0.0000 19.2166 0.0265 3.5249 2.8110 22.2520 1.6708 94.2083 21.3112 13.4295 0.0001 77.8935 19.3081 0.0000 1.6664 4.5981 0.0267 0.8542 0.0159 0.0000 4.5299 0.0000 0.0826 1.0304 1.6204 0.0460 0.0703 1.2762 5.0314 11.2106 10.9058 0.0000 26.6489 9.3700 0.0760 0.0000 0.0023 0.3277 5.0869 5.9289 43.0366 235.2564 0.0002 0.1568 1.3248 64.9704 0.0001 2.5549 26.3135 0.0001 11.4624 2.3063 92.5466 76.2713 545.3222 0.0009 0.0001 7.1613 27.5039 11.8929 122.6147 36.7925 15.3748 51.0207 2.1635 0.3593 0.0001 18.6198 56.0465 22.8364 23.1614 0.0001 0.5571 44.9490 13.1929 5.5097 67.7794 16.7924
temp: 298.150 k
press: 1.00000 atm
elementType: 7 7 6 6 6 6 6 6 6 6 6 6 6 6 6 6 6 6 6 6 1 1 1 1 1 1 1 1 1 1 1 1 1 1 1 1
symmnumber: 1
zpe: 756426.6 jmol-1
zpe.correction: 0.288108 hartree
zpe.thermalcorrener: 0.303620 hartree
zpe.thermalcorrenthalpy: 0.304564 hartree
zpe.thermalcorrgfe: 0.244942 hartree
zpe.sumelectzpe: -803.627755 hartree
zpe.sumelectthermal: -803.612243 hartree
zpe.sumelectthermalent: -803.611299 hartree
zpe.sumelectthermalfe: -803.670921 hartree
dipole: 0.2127 0.0000 -0.0208
dipole: 0.2137
quadrupole: -99.4827 -102.5939 -110.9988
quadrupole: 0.0001 -0.1279 0.0025
quadrupole: 4.8758 1.7646 -6.6403 0.0001 -0.1279 0.0025
hfenergy: -803.9158629 hartree
pointgroup: C01 [X(C18H16N2)]
dipole: -0.0836722 -0.0000055 -0.0081722 debye
polarizability: 237.9733339|0.0000856|228.8687596|-0.0479657|-0.0089118|157.7704116 unknown
InChI: InChI=1S/C18H16N2/c19-15-11-13-18(14-12-15)20(16-7-3-1-4-8-16)17-9-5-2-6-10-17/h1-14H,19H2
charge 0 multiplicity 1
36 atoms
N  0.246353 0.000017 -0.000312
N  -5.466701 0.000148 0.000866
C  -1.177926 0.000056 -0.000116
C  0.997067 1.241242 0.000154
C  0.996983 -1.24126 0.000101
C  -1.913878 1.219048 -0.000113
C  -1.913934 -1.218896 -0.000289
C  1.366252 1.850293 -1.224196
C  1.363948 -1.850826 1.224873
C  1.364774 1.85029 1.224966
C  1.36681 -1.84986 -1.224291
C  -3.324262 1.217254 -0.00012
C  -3.324313 -1.217038 -0.000257
C  -4.059941 0.000125 -0.000016
C  2.116123 3.050634 -1.223602
C  2.113705 -3.05123 1.225125
C  2.114637 3.050624 1.225275
C  2.11661 -3.050235 -1.223756
C  2.492608 3.651397 0.001061
C  2.492367 -3.651507 0.000889
H  -1.38567 2.17791 -0.000298
H  -1.385788 -2.177795 -0.000627
H  1.064287 1.38254 -2.167224
H  1.060356 -1.383418 2.16755
H  1.061695 1.382535 2.167637
H  1.065406 -1.381696 -2.167294
H  -3.858282 2.176269 -0.000151
H  -3.858374 -2.176029 -0.0004
H  2.404988 3.514799 -2.173752
H  2.400849 -3.515809 2.175595
H  2.402354 3.514797 2.175771
H  2.405994 -3.514053 -2.173917
H  3.074193 4.580562 0.001434
H  3.0739 -4.580702 0.001189
H  -5.984233 0.872862 -0.00496
H  -5.984257 -0.872548 -0.004992
