program: Gaussian 09
title: 000004458
version: EM64L-G09RevD.01
frameworkgroup: C1[X(C10H18O)]
method: RPBEPBE
basis: SDD
operation: Freq
keyword: #pfreq=noraman
keyword: PBEPBE/SDD
title: #p freq=noraman PBEPBE/SDD
converged: YES YES NO NO
title: Mulliken charges:
elementType: O C C C C C C C C C C H H H H H H H H H H H H H H H H H H
charge: -0.445003 -0.556531 -0.456076 0.488274 -0.267995 0.375088 -0.835367 -0.394907 -0.782781 -0.795362 -0.369966 0.205580 0.214518 0.208998 0.208913 0.205650 0.221631 0.247202 0.222248 0.239904 0.215840 0.228423 0.214546 0.223347 0.222167 0.218174 0.188742 0.221694 0.333050
chargesum: 0.00000
title: Mulliken charges with hydrogens summed into heavy atoms:
elementType: O C C C C C C C C C C
charge: -0.111953 -0.136433 -0.038165 0.488274 -0.062345 0.375088 -0.144286 -0.155003 -0.123972 -0.131675 0.040471
polarizability: 1.30284619e+02 2.27678921e+00 1.13432686e+02 -1.27376947e+01 1.69675793e+00 9.98388673e+01
1716.lowfreq: -4.9755 -0.0007 -0.0004 -0.0003 4.1735 10.7388 23.0922 38.3577 46.3299
frequency: 23.0682 38.1870 46.1251 73.4289 114.7710 130.0348 145.4287 165.7443 183.6451 224.6258 274.7501 297.5614 341.2937 353.2007 359.0835 397.0672 447.5691 470.6726 490.9824 502.6886 556.0246 744.1206 780.9241 809.4979 850.6246 891.6274 925.5373 932.3478 947.1038 956.5135 993.2538 995.2107 1003.8468 1035.5129 1045.1713 1081.7707 1103.3120 1120.6830 1147.8156 1162.8173 1197.8286 1223.7987 1232.9897 1283.5397 1308.6027 1329.9434 1349.7953 1362.5670 1378.6914 1386.5273 1390.9579 1398.2482 1452.8120 1455.1635 1457.5799 1462.2692 1467.3679 1470.8456 1474.0933 1476.5732 1484.0277 1679.4436 1696.9142 2948.3703 2956.6926 2962.3034 2964.9654 2968.7634 2979.0632 3021.7851 3027.3233 3030.3867 3041.2339 3045.4295 3052.2797 3068.3055 3080.5103 3087.2602 3088.8309 3093.5605 3553.0697
redmass: 3.7168 3.0095 2.9062 2.8627 2.5392 1.0896 2.0083 1.3270 1.3543 2.1760 2.0207 2.0616 2.1018 1.6438 1.9255 2.3950 2.4814 2.6363 2.5688 2.6595 2.5851 2.1960 2.1670 1.4676 1.5584 2.0155 2.4913 2.0876 1.3911 1.8978 1.2980 1.7797 2.1979 1.5426 1.7089 1.6655 1.9675 2.3173 1.2420 1.4562 1.2998 1.6956 1.9703 1.2622 1.3853 1.4963 1.2297 1.4830 1.3265 1.2877 1.2864 1.2307 1.0865 1.0538 1.0790 1.0763 1.0590 1.0490 1.0713 1.0768 1.0756 6.7601 6.5451 1.0629 1.0373 1.0408 1.0626 1.0405 1.0636 1.0962 1.0970 1.0963 1.0967 1.0925 1.0972 1.0910 1.0970 1.0957 1.0958 1.0908 1.0662
irintensity: 0.7219 0.4760 0.2066 1.9439 0.4407 0.1695 0.4839 2.0124 1.1142 1.9594 14.7687 7.1512 18.3181 48.8626 68.8441 7.1738 7.2974 2.4447 3.0205 2.5474 7.3193 6.1520 3.1503 5.9381 14.5148 4.2072 134.8614 26.9792 0.2606 3.3906 6.0336 1.6488 5.4627 4.3716 10.5888 4.2170 15.4043 6.1813 6.9772 2.7478 3.3938 4.3825 3.8592 19.0003 0.6750 1.2616 23.5817 0.4087 26.3272 18.0260 26.0845 12.9241 11.9111 2.4325 6.3742 5.2803 18.7845 22.8497 18.0843 9.8780 4.1790 15.1244 3.8829 18.1467 34.3642 69.8143 50.7533 33.4261 57.4876 6.8377 1.9333 58.3973 27.3601 25.0174 23.5304 21.4216 44.3661 24.1301 38.1486 37.3154 4.4782
temp: 298.150 k
press: 1.00000 atm
elementType: 8 6 6 6 6 6 6 6 6 6 6 1 1 1 1 1 1 1 1 1 1 1 1 1 1 1 1 1 1
symmnumber: 1
zpe: 667243.2 jmol-1
zpe.correction: 0.254140 hartree
zpe.thermalcorrener: 0.268572 hartree
zpe.thermalcorrenthalpy: 0.269516 hartree
zpe.thermalcorrgfe: 0.211498 hartree
zpe.sumelectzpe: -466.147306 hartree
zpe.sumelectthermal: -466.132874 hartree
zpe.sumelectthermalent: -466.131929 hartree
zpe.sumelectthermalfe: -466.189948 hartree
dipole: -2.1784 -1.8703 0.8228
dipole: 2.9867
quadrupole: -79.5877 -68.8838 -67.3451
quadrupole: -9.4609 0.3118 0.4624
quadrupole: -7.6488 3.0550 4.5938 -9.4609 0.3118 0.4624
hfenergy: -466.4014459 hartree
pointgroup: C01 [X(C10H18O1)]
dipole: 0.8690133 0.6895124 0.3875025 debye
polarizability: 129.6896597|1.0634053|113.5025985|13.5791191|-1.2785316|100.3639141 unknown
InChI: InChI=1S/C10H18O/c1-9(2)5-4-6-10(3)7-8-11/h5,7,11H,4,6,8H2,1-3H3
charge 0 multiplicity 1
29 atoms
O  -4.385738 -0.907451 -0.264083
C  -0.316595 1.656174 -0.795872
C  1.215418 1.526403 -0.522521
C  -1.19389 0.780586 0.09271
C  1.740139 0.127391 -0.775199
C  2.5485 -0.631145 0.020137
C  -1.031992 1.000523 1.586742
C  -2.044434 -0.130772 -0.466863
C  2.973006 -2.02754 -0.409322
C  3.102468 -0.191245 1.36506
C  -2.998346 -1.060236 0.241255
H  -0.59646 2.721313 -0.64663
H  -0.511978 1.417924 -1.859238
H  1.440188 1.859654 0.50687
H  1.730805 2.2436 -1.196427
H  1.412201 -0.314525 -1.730384
H  -1.003309 2.082342 1.820876
H  -0.076055 0.568798 1.942513
H  -1.840308 0.540706 2.178943
H  -2.071615 -0.214447 -1.56383
H  2.649772 -2.786465 0.331248
H  2.545242 -2.301758 -1.389118
H  4.076505 -2.105703 -0.48054
H  4.210553 -0.175834 1.342214
H  2.761911 0.811835 1.670464
H  2.815633 -0.909291 2.159263
H  -2.971864 -0.927454 1.34145
H  -2.762632 -2.116013 0.019102
H  -4.606924 0.058929 -0.256619
