program: Gaussian 09
title: 000075386
version: EM64L-G09RevD.01
frameworkgroup: C1[X(C20H24O2)]
method: RPBEPBE
basis: SDD
operation: Freq
keyword: #pfreq=noraman
keyword: PBEPBE/SDD
title: #p freq=noraman PBEPBE/SDD
converged: YES YES NO NO
title: Mulliken charges:
elementType: O O C C C C C C C C C C C C C C C C C C C C H H H H H H H H H H H H H H H H H H H H H H H H
charge: -0.434943 -0.435938 0.090267 -0.490142 -0.507396 -0.405254 -0.410086 -0.393175 0.489838 0.487894 -0.620814 -0.621874 -0.398539 -0.371712 0.329159 0.349376 -0.414974 -0.423783 0.129094 0.130677 -0.797238 -0.797731 0.205568 0.188781 0.225469 0.207296 0.216747 0.188050 0.190729 0.222858 0.186362 0.200158 0.251694 0.250255 0.228548 0.245390 0.213290 0.213106 0.237928 0.212815 0.238728 0.212783 0.237632 0.237274 0.353233 0.352601
chargesum: 0.00000
title: Mulliken charges with hydrogens summed into heavy atoms:
elementType: O O C C C C C C C C C C C C C C C C C C C C
charge: -0.081711 -0.083337 0.090267 -0.095794 -0.074632 -0.000457 0.003501 -0.006655 0.489838 0.487894 -0.369120 -0.371619 -0.169991 -0.126322 0.329159 0.349376 -0.201684 -0.210677 0.129094 0.130677 -0.107767 -0.110041
polarizability: 2.68882182e+02 -7.69476166e+00 2.08525871e+02 -1.48484975e+01 6.95068077e+00 1.88440868e+02
1716.lowfreq: -12.3778 -4.4097 0.0004 0.0006 0.0007 8.5215 20.4872 30.1191 41.6201
frequency: 20.2067 29.7668 41.6026 69.8413 99.4878 102.6959 113.8913 133.3855 147.2527 158.7618 200.2781 206.8622 218.6898 250.7445 258.6805 275.6958 283.5058 288.9572 333.6450 357.4799 358.2337 363.3095 383.1342 403.5256 429.7671 437.1968 439.9559 447.8980 495.9104 497.2347 511.1269 544.3930 550.6819 574.1568 602.6008 621.6378 640.8658 730.0058 737.5444 747.0396 753.2875 774.3607 785.2615 797.2414 801.6100 824.9816 863.4174 867.2461 890.1262 903.0374 913.3457 926.3624 930.5602 935.0798 935.7820 942.8557 990.8655 997.2032 1024.5247 1045.8785 1045.9697 1052.0483 1067.3276 1085.6860 1088.7149 1100.3966 1115.9950 1137.1808 1157.3755 1165.2688 1174.0755 1178.3581 1195.0708 1225.7204 1230.7492 1249.8505 1252.6353 1261.1850 1270.0951 1287.1212 1302.5191 1305.1070 1322.9125 1338.5101 1342.2191 1346.6854 1352.7909 1378.4737 1382.2125 1398.5261 1400.3282 1403.8615 1408.3035 1457.0919 1457.4168 1462.4134 1466.5111 1470.0796 1474.6668 1475.2311 1475.7978 1484.9473 1497.8407 1501.2911 1607.2315 1607.9149 1613.8930 1616.3246 2962.2243 2971.4833 2975.7557 2978.9393 2980.5248 2980.6165 2983.1421 3025.1391 3026.1107 3032.8258 3037.1446 3047.8025 3058.6645 3058.8859 3087.2916 3087.4541 3103.3633 3105.2405 3137.6369 3141.0355 3144.5331 3145.4728 3580.9331 3582.1220
redmass: 3.8195 3.6192 5.4727 4.1778 1.0308 1.0332 3.5431 3.2678 3.8700 4.2544 3.4637 3.1961 3.4297 3.2627 2.7249 3.1965 3.3071 3.8148 3.2873 1.1873 1.2008 2.8929 2.4301 3.2007 3.3239 2.9180 2.9658 3.6040 2.9225 2.5422 3.0175 3.8099 3.6684 3.5078 3.6694 3.6735 4.9534 3.7388 3.6672 4.2359 5.0455 2.7371 1.4814 1.6435 1.5081 2.8382 1.7952 2.6673 1.6399 1.6719 1.9123 1.4219 1.6029 1.4681 2.1980 2.2705 1.6374 1.5554 2.5332 1.5297 1.5239 1.8284 1.6698 1.9954 2.0947 1.6586 1.9754 1.6108 1.7380 1.3799 1.2525 1.6424 1.7124 2.1756 2.2978 2.6641 2.8033 1.5209 1.2233 1.8372 1.3359 1.3546 1.3508 1.3807 1.4553 1.3623 1.4377 5.2325 4.4600 1.4454 1.3838 2.4306 2.8611 1.0453 1.0454 1.0877 1.0901 1.1163 1.2202 1.2219 1.1224 1.1131 2.1935 2.3118 6.4997 6.4373 6.2783 6.2914 1.0625 1.0610 1.0609 1.0622 1.0363 1.0364 1.0635 1.0969 1.0981 1.0982 1.1027 1.1023 1.0969 1.0969 1.1003 1.1003 1.0886 1.0886 1.0897 1.0919 1.0921 1.0939 1.0659 1.0659
irintensity: 0.3234 0.4269 0.2379 0.3189 0.0036 0.0050 0.2502 0.0428 0.0985 0.2213 4.2764 4.3150 9.6696 3.0670 0.9694 1.8284 6.3697 5.7602 7.3080 113.9361 107.5652 20.1257 0.0449 0.9524 0.3130 4.5154 2.3385 2.6294 2.6696 2.1076 3.7523 6.1190 11.4117 4.1589 18.1303 19.8075 4.0218 0.3264 3.2800 13.1378 11.1975 1.7443 5.2968 29.1483 36.3571 2.9363 12.0775 0.9956 12.9797 12.2370 1.6578 0.6226 0.9783 1.1478 2.9542 6.2230 9.3079 9.4294 12.7817 5.8206 5.8670 1.6347 14.4425 257.6353 153.5542 0.3513 15.4762 4.6131 0.7686 21.6440 15.4501 17.1004 4.2543 2.6534 0.2487 66.7316 68.6556 15.7590 4.3633 28.2146 24.8903 6.0344 4.6065 1.1709 1.5060 7.0880 0.4114 14.0855 7.7648 8.7546 19.2991 3.2791 13.5154 10.3314 10.2544 4.4801 3.9410 10.0930 6.1783 6.1313 18.9666 33.0453 122.1443 56.6455 3.4998 3.6298 11.0387 9.4977 37.8285 12.8119 63.4083 34.7801 58.0675 6.8179 30.5241 57.8875 71.9244 14.1309 2.9568 131.5505 16.7763 18.0036 17.6431 17.5123 24.4154 23.4394 15.6332 19.6951 1.2768 8.4587 35.3696 33.1917
temp: 298.150 k
press: 1.00000 atm
elementType: 8 8 6 6 6 6 6 6 6 6 6 6 6 6 6 6 6 6 6 6 6 6 1 1 1 1 1 1 1 1 1 1 1 1 1 1 1 1 1 1 1 1 1 1 1 1
symmnumber: 1
zpe: 1016448.6 jmol-1
zpe.correction: 0.387145 hartree
zpe.thermalcorrener: 0.408316 hartree
zpe.thermalcorrenthalpy: 0.409260 hartree
zpe.thermalcorrgfe: 0.337155 hartree
zpe.sumelectzpe: -925.358348 hartree
zpe.sumelectthermal: -925.337177 hartree
zpe.sumelectthermalent: -925.336233 hartree
zpe.sumelectthermalfe: -925.408338 hartree
dipole: 0.3000 -0.6875 0.3036
dipole: 0.8092
quadrupole: -138.1583 -123.3534 -120.2660
quadrupole: 0.8303 5.7342 0.6377
quadrupole: -10.8991 3.9059 6.9932 0.8303 5.7342 0.6377
hfenergy: -925.7454929 hartree
pointgroup: C01 [X(C20H24O2)]
dipole: -0.117572 0.2854688 0.0777337 debye
polarizability: 264.3303333|-7.043993|207.2778272|23.1673236|-10.2431599|194.2407608 unknown
InChI: InChI=1S/C20H24O2/c1-14-12-16(6-8-18(14)21)20(10-4-3-5-11-20)17-7-9-19(22)15(2)13-17/h6-9,12-13,21-22H,3-5,10-11H2,1-2H3
charge 0 multiplicity 1
46 atoms
O  -4.240365 2.950441 0.233411
O  4.986187 1.91209 -0.324454
C  -0.009693 -1.038514 0.062387
C  -0.060624 -1.970982 1.316766
C  -0.070281 -1.976586 -1.194853
C  -1.303572 -2.888146 1.335419
C  -1.265614 -2.962705 -1.203966
C  -1.322487 -3.804938 0.09107
C  -1.173714 -0.008362 0.108809
C  1.32354 -0.240312 -0.008308
C  -2.016814 0.266252 -0.999314
C  2.409149 -0.451773 0.880075
C  -1.374963 0.765057 1.28096
C  1.492603 0.735843 -1.02453
C  -3.037375 1.246708 -0.971569
C  3.630492 0.258957 0.785892
C  -2.382682 1.74769 1.347751
C  2.695136 1.458078 -1.150913
C  -3.211776 1.982512 0.227801
C  3.757832 1.21775 -0.250411
C  -3.926993 1.517662 -2.167267
C  4.776193 0.02135 1.747922
H  -0.010493 -1.376804 2.248438
H  0.838532 -2.619944 1.305685
H  0.872009 -2.560861 -1.203836
H  -0.058129 -1.375098 -2.124192
H  -2.224542 -2.272739 1.360416
H  -1.297945 -3.498127 2.259863
H  -1.181748 -3.625344 -2.088043
H  -2.218505 -2.410041 -1.308564
H  -0.44726 -4.486944 0.128308
H  -2.227764 -4.442503 0.09225
H  -1.888149 -0.291976 -1.93274
H  2.321958 -1.18717 1.686312
H  -0.725606 0.618891 2.15068
H  0.66848 0.952927 -1.712909
H  -2.515854 2.334725 2.266637
H  2.802081 2.211119 -1.943651
H  -3.844692 2.570246 -2.495811
H  -3.662707 0.863249 -3.015571
H  -4.991702 1.355227 -1.917082
H  4.515662 -0.750987 2.491646
H  5.687661 -0.300996 1.211286
H  5.04602 0.949702 2.284613
H  -4.279568 3.408657 1.109198
H  4.972582 2.558221 -1.073311
