program: Gaussian 09
title: 000075329
version: EM64L-G09RevD.01
frameworkgroup: C1[X(C8H6O5)]
method: RPBEPBE
basis: SDD
operation: Freq
keyword: #p
keyword: freq=noraman
keyword: PBEPBE/SDD
title: #p freq=noraman PBEPBE/SDD
converged: YES YES NO NO
title: Mulliken charges:
elementType: O O O O O C C C C C C C C H H H H H H
charge: -0.170242 -0.431078 -0.169212 -0.270034 -0.311153 0.243201 0.125365 -0.352631 -0.307872 -0.210645 -0.212006 0.108265 0.143266 0.266072 0.283774 0.244835 0.243660 0.392626 0.383806
chargesum: 0.00000
title: Mulliken charges with hydrogens summed into heavy atoms:
elementType: O O O O O C C C C C C C C
charge: -0.170242 -0.038452 -0.169212 -0.270034 0.072654 0.243201 0.125365 -0.086559 -0.024098 0.034190 0.031654 0.108265 0.143266
polarizability: 1.44618502e+02 8.00173917e+00 1.17213080e+02 7.22039986e+00 -3.09214802e+00 5.30190344e+01
1716.lowfreq: -9.8454 -3.8889 0.0003 0.0004 0.0008 4.1853 31.9620 50.5939 90.0883
frequency: 31.9172 50.5810 90.0868 103.1208 146.9006 229.6228 244.2267 265.3811 296.5912 342.5260 346.9529 393.0589 412.7366 496.6363 539.0552 594.0950 599.2407 646.3596 674.8455 696.3591 743.9699 761.7035 793.1538 801.6232 839.2483 901.7799 951.6353 978.7736 1008.8757 1013.7866 1041.5645 1103.9162 1161.6093 1181.1120 1206.0678 1279.6511 1312.1046 1323.9012 1383.5496 1430.4729 1474.3795 1576.5687 1601.7364 1627.1285 1681.6096 3143.4594 3157.1563 3171.3003 3185.9866 3380.1672 3532.1088
redmass: 8.2954 8.6894 8.3509 5.5974 5.4777 6.2929 3.9464 8.3419 4.3401 4.0288 1.8698 7.1134 3.1872 6.2513 4.5668 1.2930 4.2308 7.0531 5.1116 4.1371 5.9417 3.0357 1.9831 5.8418 9.7192 1.4608 8.3781 1.4055 1.3700 5.1367 2.2700 2.0128 1.7476 1.0772 2.9126 1.4952 1.1373 2.5960 10.8943 2.1824 2.6510 6.9650 6.3099 8.4431 12.9712 1.0867 1.0916 1.0973 1.0974 1.0676 1.0643
irintensity: 3.5438 6.5620 0.8452 0.5492 4.4947 2.6429 14.1830 9.6901 15.9325 19.4242 60.3729 11.5058 6.9238 17.2178 5.3991 99.0181 49.1229 18.0773 6.0531 95.8927 12.7556 53.0569 25.9549 1.2936 15.0258 0.5941 88.3800 3.4106 4.7096 214.1002 14.7148 71.3102 69.5724 0.7162 65.4762 10.2344 109.2117 99.8327 10.4752 4.5526 17.8454 30.5737 21.5421 223.5887 195.6471 1.5852 6.8947 10.1285 6.7813 20.7381 60.1133
temp: 298.150 k
press: 1.00000 atm
elementType: 8 8 8 8 8 6 6 6 6 6 6 6 6 1 1 1 1 1 1
symmnumber: 1
zpe: 334657.7 jmol-1
zpe.correction: 0.127464 hartree
zpe.thermalcorrener: 0.139299 hartree
zpe.thermalcorrenthalpy: 0.140243 hartree
zpe.thermalcorrgfe: 0.088402 hartree
zpe.sumelectzpe: -683.562293 hartree
zpe.sumelectthermal: -683.550458 hartree
zpe.sumelectthermalent: -683.549514 hartree
zpe.sumelectthermalfe: -683.601355 hartree
dipole: -4.9926 2.4228 -0.3148
dipole: 5.5583
quadrupole: -70.5602 -61.1754 -81.2088
quadrupole: 11.0115 0.8235 2.3190
quadrupole: 0.4213 9.8061 -10.2273 11.0115 0.8235 2.3190
hfenergy: -683.6897573 hartree
pointgroup: C01 [X(C8H6O5)]
dipole: -2.0861411 -0.636945 0.1565158 debye
dipolederiv: -0.1683631 -0.0334093 -0.1190989 -0.1643846 -0.2122928 0.0847241 -0.3500026 0.1494774 -0.6181978 -0.4739694 -0.4491281 0.0783277 -0.3854192 -1.1489408 0.211678 0.0666617 0.2421161 -0.46632 -0.6366969 -0.1747358 0.2693471 -0.1121259 -0.3661926 0.1697156 -0.0072039 0.2152829 -0.7734059 -1.0133914 0.0843045 0.1656512 0.1516263 -0.7363153 -0.0105459 0.145738 0.028381 -0.3531816 -0.3982554 0.0714931 -0.0518128 0.3234807 -0.1152688 0.2199206 0.1060162 0.0765207 -0.2509476 -0.2491718 0.0647317 0.0022091 -0.0966222 0.1599123 0.0426816 -0.0334035 -0.0029317 -0.0839065 -0.1004953 0.2722253 0.0147969 0.3144441 -0.509117 0.0464553 -0.0834625 0.0185627 0.0131485 -0.1750036 0.1851913 -0.017114 0.0485693 0.0322738 -0.0358606 0.0101411 -0.0438777 -0.1159683 -0.0831676 -0.1155466 0.0023826 0.1034751 0.0810669 -0.0257797 -0.0275441 -0.0001573 -0.0888148 0.0736932 -0.1146831 -0.0009769 -0.0458507 0.108687 -0.0238353 0.0001329 -0.0213213 -0.1039644 0.1699499 -0.000455 -0.0265463 -0.0648565 -0.1871701 0.0033026 -0.0295225 0.0108352 -0.1409139 1.1925612 0.1605761 -0.0583839 0.0583472 0.461814 -0.3825379 0.4042717 -0.3736094 1.3397791 1.2877658 -0.0263003 -0.2998117 -0.0933372 1.8369123 -0.2102612 -0.2595972 -0.2270198 0.358925 0.0606962 -0.0716555 0.0162776 -0.0448364 0.0046202 0.0178301 -0.0026124 0.0300529 0.1489102 0.0802839 -0.050731 0.010226 -0.0562011 0.0388193 0.0156329 0.0300269 0.0037101 0.1581383 0.0342179 0.080114 -0.0028768 0.0898478 -0.0368969 0.0168065 0.004698 0.0165856 0.1561298 -0.0972414 0.0126488 0.0206827 -0.0025413 0.0885542 0.0060317 0.018641 0.0065145 0.1558872 0.1913296 0.1433901 0.0376776 0.0851125 0.3344802 -0.0148994 0.0444798 -0.044576 0.391514 0.305258 -0.0380303 -0.0409573 -0.108728 0.1650541 -0.1310592 -0.0374585 -0.0845457 0.2731885 unknown
polarizability: 141.9709933|-12.2210968|118.5629987|-4.0740264|-10.5055417|54.3166235 unknown
InChI: InChI=1S/C8H6O5/c9-7(10)5-3-1-2-4-6(5)8(11)13-12/h1-4,9,12H
charge 0 multiplicity 1
19 atoms
O  1.954898 0.395313 1.027161
O  -0.818271 -2.827362 0.451563
O  2.086297 1.178441 -1.215133
O  1.19361 -1.913713 -0.232598
O  3.412462 0.003228 0.908384
C  -0.069839 0.780045 -0.098932
C  -0.760511 -0.454891 0.089696
C  -0.796892 1.986481 -0.199887
C  -2.174189 -0.449674 0.20471
C  -2.204459 1.97926 -0.083569
C  -2.891901 0.761395 0.126308
C  1.428742 0.821715 -0.228308
C  -0.012242 -1.745616 0.083426
H  -0.25757 2.925172 -0.360501
H  -2.693764 -1.401006 0.343797
H  -2.760567 2.919642 -0.156081
H  -3.982707 0.755249 0.218382
H  -0.278803 -3.66212 0.410653
H  3.297907 -0.895261 0.465928
