program: Gaussian 09
title: 000075301
version: EM64L-G09RevD.01
frameworkgroup: C1[X(C6H14Cl2Si)]
method: RPBEPBE
basis: SDD
operation: Freq
keyword: #p
keyword: freq=noraman
keyword: PBEPBE/SDD
title: #p freq=noraman PBEPBE/SDD
converged: NO YES NO NO
title: Mulliken charges:
elementType: Cl Cl Si C C C C C C H H H H H H H H H H H H H H
charge: -0.291019 -0.291053 0.903174 -0.761744 -0.761978 -0.321890 -0.321801 -0.673374 -0.673386 0.269493 0.249155 0.269544 0.249088 0.226371 0.202183 0.226440 0.202168 0.223571 0.209740 0.216017 0.223579 0.209707 0.216014
chargesum: 0.00000
title: Mulliken charges with hydrogens summed into heavy atoms:
elementType: Cl Cl Si C C C C C C
charge: -0.291019 -0.291053 0.903174 -0.243096 -0.243345 0.106664 0.106807 -0.024046 -0.024086
polarizability: 1.13558744e+02 -4.18084908e-04 1.07966977e+02 -5.98169118e+00 8.04274544e-03 9.95090662e+01
1716.lowfreq: -14.5077 -9.8782 -8.8567 -0.0012 0.0017 0.0032 27.7454 54.1771 57.8287
frequency: 25.3874 54.1311 57.3439 60.5376 69.3914 92.7488 136.9995 177.3623 177.7748 228.5810 229.7036 255.2822 263.5087 282.7135 357.0649 450.7012 486.2628 677.6285 705.0699 723.2736 780.1915 814.3294 830.6335 895.9058 902.4426 1016.3384 1027.4828 1047.0443 1047.1500 1077.7272 1078.6109 1213.7489 1214.3902 1226.0201 1235.9345 1293.6108 1296.4075 1332.1041 1335.8312 1387.7462 1387.9327 1420.2449 1422.9309 1472.6170 1473.5459 1474.8451 1475.5089 1483.5414 1484.3509 2974.8566 2975.5195 2977.3353 2977.5362 2986.7301 2988.2545 3026.5665 3026.6713 3056.1773 3057.0575 3077.2520 3077.3490 3079.2759 3079.8574
redmass: 2.9916 1.7025 1.6855 3.4513 6.5232 3.9505 10.5983 2.9320 3.8072 1.1042 1.0996 3.3123 3.8898 4.7953 3.5086 7.4814 10.9144 3.2238 1.2156 1.1860 3.2310 1.3327 1.2882 2.0933 2.2628 1.1577 1.2652 2.3899 2.7154 2.0721 2.0790 1.4075 1.4087 1.3512 1.3286 1.0898 1.0844 1.3889 1.3875 1.2057 1.2056 1.0774 1.0768 1.0472 1.0435 1.0460 1.0456 1.0781 1.0828 1.0582 1.0580 1.0380 1.0383 1.0613 1.0611 1.0983 1.0984 1.0997 1.1003 1.1003 1.1001 1.1005 1.1006
irintensity: 0.0979 0.0134 0.4499 1.3428 0.0009 2.4151 3.2983 2.2543 8.1451 0.0425 0.0413 0.0324 0.7211 0.9233 15.1796 56.3507 100.5883 6.0100 35.5115 38.9798 39.1510 8.9614 6.9956 0.5193 7.2975 15.8208 10.6521 8.0682 2.8514 49.5308 44.7222 0.3009 1.1765 8.6913 10.8928 0.2296 0.3504 0.3445 0.7720 14.9610 3.0020 22.3318 0.0171 1.4480 15.6153 16.2699 2.0589 24.1482 1.3805 47.8284 1.5422 30.3475 24.4404 0.7676 31.5970 2.3532 5.4195 4.7860 2.5142 94.7455 3.5163 19.7553 80.0472
temp: 298.150 k
press: 1.00000 atm
elementType: 17 17 14 6 6 6 6 6 6 1 1 1 1 1 1 1 1 1 1 1 1 1 1
symmnumber: 1
zpe: 496576.3 jmol-1
zpe.correction: 0.189136 hartree
zpe.thermalcorrener: 0.203013 hartree
zpe.thermalcorrenthalpy: 0.203957 hartree
zpe.thermalcorrgfe: 0.145919 hartree
zpe.sumelectzpe: -1445.887000 hartree
zpe.sumelectthermal: -1445.873122 hartree
zpe.sumelectthermalent: -1445.872178 hartree
zpe.sumelectthermalfe: -1445.930216 hartree
dipole: 0.0048 4.3742 -0.0018
dipole: 4.3742
quadrupole: -75.0445 -84.3553 -82.6927
quadrupole: -0.0033 3.5843 -0.0026
quadrupole: 5.6530 -3.6578 -1.9952 -0.0033 3.5843 -0.0026
hfenergy: -1446.0761357 hartree
pointgroup: C01 [X(C6H14Cl2Si1)]
dipole: -0.0073384 -1.7209263 -0.0010262 debye
dipolederiv: -0.4947163 0.1200396 -0.1146341 0.113289 -0.5653668 0.1991148 -0.1144117 0.2520426 -0.6163502 -0.4968962 -0.1205424 -0.1164962 -0.1136519 -0.5628118 -0.1978181 -0.1168814 -0.2508217 -0.6167846 1.4793724 0.0004373 0.2251852 0.000322 1.5646277 -0.0011887 0.1791634 -0.0011116 1.5999001 -0.3148477 -0.0226732 -0.0097528 -0.0728889 -0.3282473 -0.0373939 -0.0517527 -0.111247 -0.2866374 -0.3146059 0.0228105 -0.0098916 0.0730752 -0.3287365 0.0371427 -0.0508918 0.1117224 -0.2867894 0.0638295 -0.0837967 -0.0128134 -0.0224755 0.1195904 -0.0072598 0.1932665 0.1712301 0.0939358 0.0650792 0.0837873 -0.0129185 0.0231144 0.1184362 0.0070453 0.1919118 -0.1728583 0.0936844 -0.0154324 -0.0775428 0.0248984 -0.0987557 0.0138405 0.0011913 -0.0452291 -0.057157 0.0636733 -0.0142792 0.0779478 0.0249137 0.0988563 0.0128183 -0.0014426 -0.0448563 0.0573841 0.0636416 -0.0396262 0.103038 0.0593556 0.0204824 0.0397451 -0.0451323 0.0325908 -0.0657003 0.056736 0.0805256 -0.033002 -0.0205113 0.0268111 -0.0010406 0.1068423 -0.085387 0.0544154 -0.045929 -0.0401867 -0.1022272 0.0600276 -0.0198257 0.0408084 0.044964 0.0332413 0.065714 0.0562216 0.0804467 0.0322239 -0.0215407 -0.0280417 -0.0014463 -0.1067984 -0.0861382 -0.0541083 -0.0453164 0.0543157 0.0049562 -0.0392654 0.0287047 0.0176307 0.1057796 -0.0502331 0.0671998 -0.0670723 -0.0753089 0.1032363 0.0745611 0.0931206 -0.0360361 -0.0697765 0.0557805 -0.0564694 0.0325291 0.0538794 -0.0055276 -0.0402567 -0.0293853 0.0175995 -0.105526 -0.0510035 -0.0669141 -0.0661978 -0.0762926 -0.1026956 0.0755559 -0.0924534 -0.0343946 0.0696919 0.0566992 0.0564852 0.0319995 -0.0117357 -0.1157658 -0.0543975 -0.1297362 -0.0327448 -0.091976 -0.0831805 -0.1129041 -0.0170742 0.0490717 0.0554079 -0.0774347 0.0184531 0.017674 0.1017774 -0.020648 0.1334928 -0.0749554 -0.0346793 0.0758081 0.05849 0.1391754 -0.028647 -0.0570152 0.0808609 -0.0300546 0.0614013 -0.0103417 0.1157337 -0.0540391 0.1295733 -0.0339558 0.0920822 -0.0826888 0.1132517 -0.0172223 0.0483494 -0.0561002 -0.0782982 -0.0189557 0.0176602 -0.1014102 -0.0217979 -0.1334622 -0.0742908 -0.0359207 -0.075553 0.0592627 -0.1388075 -0.0270033 0.0571063 0.0815857 0.0298705 0.0608971 unknown
polarizability: 112.6056877|-0.0153197|107.9670292|6.9470145|-0.029493|100.46207 unknown
InChI: InChI=1S/C6H14Cl2Si/c1-3-5-9(7,8)6-4-2/h3-6H2,1-2H3
charge 0 multiplicity 1
23 atoms
Cl -0.753891 2.238968 -1.60675
Cl 0.772088 2.230325 1.609319
Si 0.003335 0.927206 0.00043
C  -1.470749 -0.041813 0.699774
C  1.468587 -0.053945 -0.700064
C  -2.144707 -0.990408 -0.32806
C  2.138798 -1.004251 0.328433
C  -3.35684 -1.727982 0.283023
C  3.344536 -1.751477 -0.283649
H  -2.20846 0.687954 1.085017
H  -1.111258 -0.615157 1.578134
H  2.210044 0.669949 -1.089229
H  1.102906 -0.627257 -1.575834
H  -2.474649 -0.407458 -1.209666
H  -1.411722 -1.736513 -0.696449
H  2.474747 -0.421311 1.207749
H  1.401805 -1.744546 0.700573
H  -3.829494 -2.397513 -0.458482
H  -3.054744 -2.341612 1.152086
H  -4.122445 -1.008402 0.627264
H  3.814182 -2.422673 0.458257
H  3.036374 -2.364835 -1.150778
H  4.114357 -1.037951 -0.631097
