program: Gaussian 09
title: 000075295
version: EM64L-G09RevD.01
frameworkgroup: C1[X(C15H13N)]
method: RPBEPBE
basis: SDD
operation: Freq
keyword: #pfreq=noraman
keyword: PBEPBE/SDD
title: #p freq=noraman PBEPBE/SDD
converged: YES YES NO NO
title: Mulliken charges:
elementType: N C C C C C C C C C C C C C C C H H H H H H H H H H H H H
charge: -0.012784 -0.352687 0.458184 0.494250 -0.519811 -0.389673 -0.380162 -0.404291 -0.444596 -0.233893 -0.228478 -0.243908 -0.224897 -0.239961 -0.243003 -0.141585 0.234450 0.263473 0.275259 0.235163 0.253290 0.237236 0.235850 0.227061 0.227717 0.227918 0.228420 0.230318 0.231140
chargesum: 0.00000
title: Mulliken charges with hydrogens summed into heavy atoms:
elementType: N C C C C C C C C C C C C C C C
charge: -0.012784 -0.118237 0.458184 0.494250 0.018921 -0.154510 -0.126872 -0.167055 -0.208746 -0.006832 -0.000761 -0.015990 0.003524 -0.009643 -0.011863 -0.141585
polarizability: 1.95958130e+02 8.35785751e-01 1.43840942e+02 1.27735432e+01 7.23611395e+00 1.25732092e+02
1716.lowfreq: -8.3745 -0.0004 -0.0001 0.0003 5.8198 20.0483 28.3014 35.0210 63.8491
frequency: 27.7025 34.9364 63.7064 71.1172 80.4135 166.4332 214.5029 224.5467 258.5619 288.2349 363.3240 384.2768 401.6461 403.5672 464.5771 501.3334 545.5082 591.4778 617.1223 620.8965 629.7055 703.5789 706.8216 739.4162 765.5790 781.5585 835.7946 851.3607 856.8564 915.2124 920.7769 948.4505 952.3342 976.8350 979.7999 990.3053 991.1991 996.1579 998.2544 1018.7881 1027.1585 1038.0392 1082.1328 1095.1594 1172.9835 1174.9292 1186.2009 1188.0965 1189.7780 1199.8532 1210.5881 1242.5949 1305.8629 1317.8152 1333.7932 1344.0939 1380.1007 1386.2349 1439.1917 1442.9977 1455.1729 1480.7401 1489.1101 1592.0991 1595.7930 1610.5257 1617.0124 2196.7340 2993.6629 3004.5375 3056.7644 3111.4039 3117.3044 3124.3513 3126.9137 3135.9067 3138.6421 3146.8842 3149.2465 3164.2070 3165.5558
redmass: 3.9344 3.8755 5.1085 6.4124 5.6280 5.4561 3.6823 4.3372 4.6259 4.9585 5.9326 2.8827 2.8090 2.8099 3.7280 4.3579 3.4726 4.2050 6.3302 6.1660 4.8603 1.7457 1.7575 2.5737 1.8561 2.4883 3.7201 1.2516 1.2464 1.6633 1.4712 2.1762 3.0173 1.4086 1.4020 5.8559 5.6458 1.3296 1.3360 3.6557 2.2146 2.3275 1.6054 1.6251 1.0628 1.0536 1.2196 1.6833 1.4357 1.1307 2.1342 1.3751 1.3774 1.3902 1.2863 1.3244 7.4853 6.6994 2.2146 2.1381 1.1023 2.2409 2.2405 6.0486 5.9504 6.0589 6.0127 12.4366 1.0803 1.0624 1.1003 1.0881 1.0873 1.0858 1.0858 1.0908 1.0912 1.0958 1.0958 1.1014 1.1015
irintensity: 0.1355 0.2865 0.5403 3.7659 1.8731 3.9156 2.6894 1.0813 0.3376 0.0668 1.6444 1.0945 0.3581 0.0704 3.9568 2.5290 25.9272 1.0973 0.5781 1.9114 16.4188 52.9869 51.9203 32.3957 42.3733 14.5699 0.7036 0.1167 0.0672 1.1729 1.0953 5.3759 0.6168 0.0268 0.0212 0.6060 1.1191 0.1029 0.3184 1.1417 9.9395 2.7340 7.2396 11.0007 0.1415 0.0365 1.2243 0.9034 1.6678 0.1273 1.1605 1.9034 3.5847 5.2740 2.0165 1.2801 0.6722 0.5682 12.0815 5.9389 26.0263 22.4166 12.7370 2.5455 0.3932 10.5845 3.7132 10.9727 6.6444 10.2282 6.0254 9.5168 6.8832 1.1261 1.0339 8.8824 15.6830 32.4563 41.7203 28.4072 17.2838
temp: 298.150 k
press: 1.00000 atm
elementType: 7 6 6 6 6 6 6 6 6 6 6 6 6 6 6 6 1 1 1 1 1 1 1 1 1 1 1 1 1
symmnumber: 1
zpe: 610770.4 jmol-1
zpe.correction: 0.232630 hartree
zpe.thermalcorrener: 0.246227 hartree
zpe.thermalcorrenthalpy: 0.247171 hartree
zpe.thermalcorrgfe: 0.190381 hartree
zpe.sumelectzpe: -633.023725 hartree
zpe.sumelectthermal: -633.010129 hartree
zpe.sumelectthermalent: -633.009184 hartree
zpe.sumelectthermalfe: -633.065974 hartree
dipole: 3.1678 -2.7598 -0.6274
dipole: 4.2480
quadrupole: -92.6920 -103.8689 -87.3335
quadrupole: 14.4688 4.5167 -0.5964
quadrupole: 1.9395 -9.2374 7.2980 14.4688 4.5167 -0.5964
hfenergy: -633.2563555 hartree
pointgroup: C01 [X(C15H13N1)]
dipole: 1.3133946 1.0218777 0.1546426 debye
polarizability: 194.7927898|-4.2043531|144.8296057|-14.4700817|7.2051211|125.9087683 unknown
InChI: InChI=1S/C15H13N/c16-12-11-15(13-7-3-1-4-8-13)14-9-5-2-6-10-14/h1-10,15H,11H2
charge 0 multiplicity 1
29 atoms
N  -2.384951 -3.4719 0.136013
C  -0.005341 -0.815375 -0.389734
C  -1.09805 0.24674 -0.213014
C  1.412648 -0.251389 -0.1897
C  -0.15725 -2.064239 0.543059
C  -1.230424 1.246504 -1.212884
C  1.697622 0.67903 0.841569
C  -1.964163 0.296772 0.906436
C  2.476267 -0.711694 -1.006715
C  -2.197895 2.266183 -1.099201
C  3.017798 1.135155 1.052649
C  -2.936199 1.317814 1.025045
C  3.797426 -0.25517 -0.799783
C  -3.056704 2.306927 0.025095
C  4.072907 0.668936 0.234268
C  -1.394239 -2.83381 0.324446
H  -0.066689 -1.191801 -1.430199
H  -0.101869 -1.755616 1.604027
H  0.704179 -2.735975 0.370308
H  -0.564651 1.224455 -2.08487
H  0.881372 1.062851 1.464554
H  -1.9092 -0.466397 1.690322
H  2.268033 -1.426357 -1.813733
H  -2.28525 3.024966 -1.884927
H  3.222972 1.857895 1.85046
H  -3.602013 1.333395 1.895125
H  4.607297 -0.615603 -1.443968
H  -3.81222 3.095262 0.115058
H  5.095887 1.026443 0.395994
