program: Gaussian 09
title: 000075254
version: EM64L-G09RevD.01
frameworkgroup: C1[X(C5H5F3O2)]
method: RPBEPBE
basis: SDD
operation: Freq
keyword: #pfreq=noraman
keyword: PBEPBE/SDD
title: #p freq=noraman PBEPBE/SDD
converged: YES YES NO NO
title: Mulliken charges:
elementType: F F F O O C C C C C H H H H H
charge: -0.153611 -0.158700 -0.153697 -0.270656 -0.207851 0.365328 0.298175 0.278675 -0.739806 -0.577733 0.262056 0.261941 0.250554 0.294560 0.250765
chargesum: 0.00000
title: Mulliken charges with hydrogens summed into heavy atoms:
elementType: F F F O O C C C C C
charge: -0.153611 -0.158700 -0.153697 -0.270656 -0.207851 0.365328 0.298175 0.278675 0.034744 -0.032408
polarizability: 7.28227799e+01 6.16886703e+00 7.39118825e+01 -9.29690950e-02 -7.79689584e-03 3.87323703e+01
1716.lowfreq: -10.9890 -1.6257 -0.0010 -0.0010 0.0002 10.5108 36.3083 44.1744 72.2010
frequency: 36.2613 43.7460 72.1738 118.5038 138.3916 239.5100 239.6258 304.7199 359.1077 402.8283 434.1876 516.5531 518.8802 547.1161 638.8482 641.0521 732.7505 742.3371 776.3050 939.1732 958.4766 996.5848 1007.7302 1042.8803 1048.7502 1089.7967 1160.9462 1298.7163 1389.6512 1401.3809 1450.6224 1451.0529 1644.6999 1682.3259 3012.0701 3099.6910 3148.1637 3149.0347 3270.7187
redmass: 8.1266 5.1982 1.1817 3.5350 5.9580 10.4366 9.3606 7.3861 3.0932 5.4143 12.2144 6.7175 8.1156 2.9498 6.7332 8.5056 1.1102 5.1372 5.3492 2.6719 1.3394 2.2543 9.6282 1.6405 8.7767 4.1492 3.2803 5.0699 1.2341 1.1861 1.0455 1.0558 6.2792 10.1469 1.0369 1.0972 1.0654 1.0987 1.1155
irintensity: 3.3400 1.2654 0.5479 4.8209 5.1680 0.4109 0.2735 1.8058 1.0704 5.4536 1.1622 29.4167 3.9460 2.9499 6.5708 0.4220 1.9612 23.1422 19.7419 11.8489 59.0300 81.4593 283.8642 15.4023 223.2468 372.5188 328.7769 71.1717 50.8508 59.8839 19.8289 26.7856 62.4010 141.3414 0.0305 3.3893 2.4984 7.1657 2.5870
temp: 298.150 k
press: 1.00000 atm
elementType: 9 9 9 8 8 6 6 6 6 6 1 1 1 1 1
symmnumber: 1
zpe: 249692.7 jmol-1
zpe.correction: 0.095103 hartree
zpe.thermalcorrener: 0.105641 hartree
zpe.thermalcorrenthalpy: 0.106586 hartree
zpe.thermalcorrgfe: 0.057395 hartree
zpe.sumelectzpe: -642.716373 hartree
zpe.sumelectthermal: -642.705834 hartree
zpe.sumelectthermalent: -642.704890 hartree
zpe.sumelectthermalfe: -642.754080 hartree
dipole: -2.2781 -0.0348 -0.0280
dipole: 2.2786
quadrupole: -57.5194 -54.3931 -57.5021
quadrupole: 9.7291 0.0619 -0.0754
quadrupole: -1.0479 2.0784 -1.0305 9.7291 0.0619 -0.0754
hfenergy: -642.8114757 hartree
pointgroup: C01 [X(C5H5F3O2)]
dipole: 0.8916827 -0.0922763 0.0058616 debye
dipolederiv: -0.3621074 0.0981293 -0.0350261 0.0549093 -0.8094176 -0.1780815 -0.0443199 -0.160814 -0.3987974 -0.7943383 -0.1619925 0.1083831 -0.0998839 -0.3863736 0.0583109 0.0749386 0.0607331 -0.3238051 -0.3635384 0.0873405 -0.090081 0.0737977 -0.3676351 0.120068 -0.0479457 0.0990172 -0.8380344 -1.9659335 -0.2961452 0.2249591 0.0829688 -0.4441161 0.1569716 0.0132696 0.1718113 -0.2592453 -0.7111063 -0.0327253 0.0322685 0.3935149 -0.6459334 0.1939452 -0.2125705 0.206205 -0.3991591 0.7844249 0.4117158 -0.2624813 0.4144917 0.1922978 -0.1643494 -0.2691648 -0.1661243 0.0239898 1.5040762 -0.2013981 0.1172314 -0.1004004 1.5985376 0.0058137 0.0600426 0.0111374 1.5953042 2.0670875 0.2106941 -0.1744823 -0.5196442 0.8413517 -0.3312874 0.2421031 -0.3538293 0.4313499 -0.1776531 -0.1418242 0.0857909 -0.2114756 -0.2287562 0.1391048 0.1235598 0.1350613 -0.0760072 -0.2023082 0.0036332 -0.0083988 -0.16765 -0.2815637 -0.0171979 0.0880747 -0.0243313 -0.3125884 0.0916713 0.0235883 0.0484727 0.0162322 0.0080449 -0.0693436 0.0174383 -0.0844955 0.0956488 0.0857537 -0.0265156 -0.0531938 -0.0041353 0.1419182 -0.0018563 -0.0298106 0.0143878 -0.0323948 -0.0615386 0.0211476 -0.0039226 0.0593805 0.0803316 0.0281798 -0.0251583 0.0303969 0.1185384 0.0891255 0.0406963 -0.016846 0.0524935 0.1543992 0.0377621 -0.0229289 0.0393976 0.2052754 0.0163848 -0.0363442 0.0273262 -0.0445991 0.1469146 0.02196 0.0324721 0.0214467 0.1699251 unknown
polarizability: 74.1315771|4.8399168|64.3287173|-3.9201213|-14.5181796|47.0067383 unknown
InChI: InChI=1S/C5H5F3O2/c1-3(5(6,7)8)10-4(2)9/h1H2,2H3
charge 0 multiplicity 1
15 atoms
F  -1.551406 1.549031 0.264804
F  -2.792441 -0.339663 0.060642
F  -1.630261 0.45715 -1.718211
O  0.779882 0.109506 -0.335973
O  2.378101 -1.414017 0.486289
C  -0.378994 -0.575417 0.094836
C  -1.572725 0.259395 -0.31785
C  2.112311 -0.357407 -0.110042
C  3.073685 0.637713 -0.708037
C  -0.496655 -1.750998 0.753624
H  2.935093 1.626888 -0.238504
H  2.872235 0.758622 -1.78628
H  4.105399 0.291307 -0.554759
H  0.374322 -2.337333 1.044009
H  -1.496045 -2.117977 1.000252
