program: Gaussian 09
title: 000002062
version: EM64L-G09RevD.01
frameworkgroup: C1[X(C19H15N3O3S2)]
method: RPBEPBE
basis: SDD
operation: Freq
keyword: #p
keyword: freq=noraman
keyword: PBEPBE/SDD
title: #p freq=noraman PBEPBE/SDD
converged: YES YES NO NO
title: Mulliken charges:
elementType: S S O O O N N N C C C C C C C C C C C C C C C C C C C H H H H H H H H H H H H H H H
charge: 0.210126 0.301821 -0.282927 -0.406690 -0.273472 0.021616 -0.637222 -0.040503 0.435446 -0.852937 -0.002793 -0.551995 0.570797 0.233159 -0.586263 -0.348352 0.372513 -0.492608 -0.340498 -0.271956 -0.332993 -0.235547 -0.208038 0.155863 -0.503742 0.170330 -0.309568 0.308404 0.342077 0.261860 0.269474 0.280324 0.249435 0.259001 0.235102 0.236054 0.364615 0.259278 0.215187 0.233388 0.351674 0.340561
chargesum: 0.00000
title: Mulliken charges with hydrogens summed into heavy atoms:
elementType: S S O O O N N N C C C C C C C C C C C C C C C C C C C
charge: 0.210126 0.301821 -0.282927 -0.042075 -0.273472 0.021616 0.055012 -0.040503 0.435446 -0.202456 -0.002793 -0.290135 0.570797 0.233159 -0.316789 -0.348352 0.372513 -0.492608 -0.060174 -0.022520 -0.073991 -0.000446 0.028016 0.155863 0.204111 0.170330 -0.309568
polarizability: 4.92917582e+02 -2.08172144e+01 2.82029394e+02 -1.24158193e+01 -3.33178331e+00 1.91762318e+02
1716.lowfreq: -4.9997 -0.0010 0.0011 0.0013 1.0505 2.5673 7.9135 14.8232 22.8699
frequency: 6.4705 14.7545 22.8613 30.0646 48.5997 54.4194 67.0416 75.0268 83.7472 103.5984 110.7389 140.7273 147.9341 159.7152 175.9677 185.1730 214.9105 225.6463 230.0880 253.5892 274.1641 288.0040 302.4330 320.9487 350.5227 361.9202 378.9161 392.5255 415.6090 429.3608 459.9046 486.2564 494.0706 507.9762 512.2597 519.4126 542.5154 553.2270 560.9904 573.5804 582.3891 586.4273 590.9835 617.5491 620.7967 646.0237 657.3252 672.8165 679.7412 732.1621 740.5202 747.4834 766.8757 773.6638 800.9588 835.9524 865.1158 877.7822 894.0628 899.9444 908.2626 929.0812 948.7667 987.5058 989.2774 1003.3271 1017.0149 1036.4578 1039.5216 1054.9943 1077.7935 1110.2061 1119.2952 1137.5965 1150.3752 1161.3077 1170.3280 1202.5243 1223.4042 1249.6072 1253.7637 1274.3222 1282.3430 1313.9909 1349.7593 1360.2762 1376.8305 1408.5320 1422.2544 1430.1417 1441.4233 1444.2973 1453.4088 1456.7033 1471.0955 1473.0304 1483.4198 1569.1537 1572.8559 1581.1694 1602.1879 1605.7464 1610.8037 1648.4702 2133.5213 2989.5881 3030.9915 3091.8434 3101.4640 3125.7992 3136.7046 3140.1371 3153.8529 3155.3628 3167.5811 3174.0880 3178.1982 3337.9646 3516.1651 3670.0911
redmass: 6.9076 7.3335 8.8523 6.3979 3.1490 7.5117 5.3229 5.2635 5.9796 6.2603 4.9881 8.1168 6.7019 1.7905 5.5278 5.7766 4.1142 4.8463 4.0548 5.2804 4.6500 6.4641 5.3142 4.5021 5.0080 9.2360 9.4210 4.9027 5.2180 3.1437 5.5584 8.9078 7.0735 4.5451 3.4483 1.7640 3.0453 2.0249 1.4414 6.1508 4.8849 4.5309 4.6687 2.1066 4.9448 3.8822 4.9439 5.6664 6.6430 2.6823 7.4415 3.7106 1.5308 5.0113 5.9955 6.8697 1.3816 2.2069 2.7631 1.5458 9.9542 1.7643 1.3831 1.3244 4.3886 1.4389 2.2388 3.7763 5.0287 1.9302 3.5038 1.2377 1.5471 1.2439 1.3808 2.0725 1.1301 1.7256 2.8196 1.9064 1.2890 1.5611 1.5194 2.5105 3.8843 2.6581 4.9528 3.2080 3.0335 2.8198 1.3939 2.5480 1.3005 1.0898 1.0645 8.7367 2.5184 6.2852 3.5129 4.8845 7.1359 3.1104 2.9865 3.6248 12.5907 1.0333 1.0613 1.0878 1.0987 1.1051 1.1058 1.0859 1.0905 1.0920 1.0958 1.0917 1.0999 1.0660 1.0455 1.1041
irintensity: 0.0481 0.0684 0.1104 0.3420 7.1521 0.7976 3.9157 3.5512 10.2869 2.2057 2.3537 9.9753 2.6977 2.9419 3.2420 1.4348 5.7519 1.0061 0.2947 1.8672 2.8737 1.0815 3.2832 8.4212 10.6338 4.2683 3.0433 1.0484 11.7337 7.3459 10.7825 0.4165 27.9499 7.7912 12.1140 0.9396 45.2478 74.1223 161.7758 12.0895 4.6722 13.0268 33.7101 95.0934 50.2829 6.1554 32.2581 2.5474 2.6754 19.0512 29.6282 7.2749 74.3236 2.6019 12.4736 7.6144 0.8669 6.6987 5.6417 17.8232 238.7077 13.3862 2.3093 0.0248 2.3094 18.7357 5.5186 42.2195 10.8318 21.2234 1.6132 2.3751 3.6699 14.6811 16.0188 113.3904 0.5647 159.6246 2.8754 120.6283 106.0016 4.3397 164.5097 392.0510 103.3220 24.4501 8.4914 40.3834 39.6918 52.1381 11.4848 15.3088 104.4581 8.1239 51.4389 221.0442 102.2616 1.8055 492.9101 61.4867 5.2268 41.0652 12.6801 300.7386 59.8298 72.3694 12.6264 1.1980 38.0585 7.4213 16.6225 1.4390 7.7542 1.2767 14.9570 2.5557 17.9228 609.6988 69.3956 54.6720
temp: 298.150 k
press: 1.00000 atm
elementType: 16 16 8 8 8 7 7 7 6 6 6 6 6 6 6 6 6 6 6 6 6 6 6 6 6 6 6 1 1 1 1 1 1 1 1 1 1 1 1 1 1 1
symmnumber: 1
zpe: 790553.5 jmol-1
zpe.correction: 0.301106 hartree
zpe.thermalcorrener: 0.326816 hartree
zpe.thermalcorrenthalpy: 0.327761 hartree
zpe.thermalcorrgfe: 0.240651 hartree
zpe.sumelectzpe: -1917.154292 hartree
zpe.sumelectthermal: -1917.128581 hartree
zpe.sumelectthermalent: -1917.127637 hartree
zpe.sumelectthermalfe: -1917.214746 hartree
dipole: -5.1875 0.0906 -0.3792
dipole: 5.2021
quadrupole: -157.3641 -165.4558 -170.5877
quadrupole: -9.6753 -6.6830 -7.5615
quadrupole: 7.1051 -0.9866 -6.1185 -9.6753 -6.6830 -7.5615
hfenergy: -1917.4553974 hartree
pointgroup: C01 [X(C19H15N3O3S2)]
dipole: -2.0121841 -0.2368149 0.2895736 debye
polarizability: 486.7235579|41.7043139|288.1060743|-8.0859218|-8.5535782|191.8796616 unknown
InChI: InChI=1S/C19H15N3O3S2/c1-25-15-8-11(6-12(9-20)18(21)24)7-13(17(15)23)10-26-19-22-14-4-2-3-5-16(14)27-19/h2-8,23H,10,21H2,1H3
charge 0 multiplicity 1
42 atoms
S  -1.458431 -0.190174 1.747269
S  -4.530822 -0.064662 2.387187
O  2.413412 -3.794819 -0.361667
O  -0.216531 -2.603954 0.039867
O  7.199045 1.42038 -0.572472
N  -3.516729 0.109593 -0.107743
N  6.543286 3.640114 -0.372264
N  3.100813 3.842635 0.048413
C  0.835301 -0.373418 0.061822
C  -0.510532 0.297701 0.120802
C  0.924579 -1.800425 -0.012711
C  2.002146 0.410052 -0.013143
C  3.279525 -0.19377 -0.204971
C  2.195071 -2.425749 -0.197678
C  3.34153 -1.613732 -0.296099
C  -5.661306 0.116203 0.972375
C  -4.918641 0.199556 -0.25115
C  -3.158517 -0.028351 1.146104
C  4.538346 0.53124 -0.312998
C  -7.066955 0.18052 0.989083
C  -5.604313 0.352573 -1.478355
C  -7.73603 0.333982 -0.247025
C  -7.011632 0.419048 -1.466217
C  4.825164 1.882527 -0.26753
C  1.593981 -4.777916 0.380145
C  6.283907 2.284158 -0.417144
C  3.859259 2.922575 -0.093304
H  -0.424797 1.393095 0.131295
H  -1.201807 -0.011066 -0.682104
H  1.907197 1.496695 0.054329
H  4.302281 -2.11994 -0.438229
H  5.440031 -0.084308 -0.45757
H  -7.632829 0.116675 1.923188
H  -5.032418 0.415562 -2.408631
H  -8.829637 0.388381 -0.260239
H  -7.555372 0.537752 -2.409127
H  -0.955859 -2.128509 0.520157
H  0.566844 -4.816141 -0.012221
H  1.572438 -4.534213 1.458577
H  2.112995 -5.735239 0.221042
H  5.806717 4.33452 -0.248319
H  7.510491 3.945548 -0.468747
