program: Gaussian 09
title: 000075243
version: EM64L-G09RevD.01
frameworkgroup: C1[X(C13H9NO3)]
method: RPBEPBE
basis: SDD
operation: Freq
keyword: #p
keyword: freq=noraman
keyword: PBEPBE/SDD
title: #p freq=noraman PBEPBE/SDD
converged: YES YES NO NO
title: Mulliken charges:
elementType: O O O N C C C C C C C C C C C C C H H H H H H H H H
charge: -0.217050 -0.201409 -0.201351 0.021180 0.339206 0.295907 0.016466 -0.488257 -0.368469 0.366758 -0.356390 -0.353642 -0.193984 -0.362290 -0.233486 -0.228520 -0.224667 0.322885 0.282509 0.261659 0.273280 0.246489 0.291965 0.236957 0.236812 0.237442
chargesum: 0.00000
title: Mulliken charges with hydrogens summed into heavy atoms:
elementType: O O O N C C C C C C C C C C C C C
charge: -0.217050 -0.201409 -0.201351 0.021180 0.339206 0.295907 0.016466 -0.165371 -0.085961 0.366758 -0.094731 -0.080362 0.052504 -0.070325 0.003471 0.008292 0.012775
polarizability: 2.24156531e+02 -1.37672004e+01 1.73877737e+02 -1.79567422e+01 -4.96501057e+00 8.40388690e+01
1716.lowfreq: -4.9071 -2.8365 0.0005 0.0006 0.0009 5.6032 37.8757 49.6070 53.9084
frequency: 37.8455 49.6055 53.9081 73.1964 128.4013 159.6732 180.8587 218.4531 260.8214 296.3264 340.8587 391.7025 403.9177 424.6162 434.0212 455.7917 508.2438 568.1089 614.0337 633.6526 653.5828 668.2821 696.3971 699.7296 719.8463 732.0324 798.0456 820.4511 835.5084 862.4517 930.6715 950.1071 958.0817 967.3806 988.4136 989.5662 992.9946 1007.8730 1009.0465 1027.2287 1086.4790 1087.0583 1088.3776 1156.0816 1175.4387 1176.4623 1190.8869 1215.0559 1272.6795 1299.4811 1319.6741 1372.8340 1385.2628 1393.5696 1428.6547 1434.6486 1468.3563 1479.5068 1539.1779 1581.0415 1589.0896 1607.8200 1612.3348 3132.7785 3141.2700 3151.7139 3152.3648 3161.2823 3169.5265 3172.1069 3179.3909 3187.2158
redmass: 7.7200 5.7122 7.1487 5.5895 6.5925 6.6388 5.0789 5.0464 6.5448 5.7308 10.1261 6.5311 2.8566 3.5082 4.4114 5.8475 6.6902 5.7371 6.4555 6.7618 6.0596 6.0693 2.4928 2.1539 4.9668 2.8393 2.2517 7.5415 1.6960 1.2498 3.1727 1.6429 1.5546 1.3875 6.0255 4.4220 1.5120 1.3418 1.3716 2.1558 1.5798 1.6344 1.8727 3.2012 1.1791 1.0578 1.1335 7.3503 2.0193 1.9571 1.3664 10.1723 8.4238 7.1182 3.3636 2.2806 2.5523 2.3250 9.7685 6.2472 6.6481 6.1151 7.0342 1.0853 1.0881 1.0925 1.0879 1.0964 1.0942 1.1014 1.0921 1.0972
irintensity: 3.8509 1.1335 1.8512 0.8714 2.2086 4.2534 0.8320 1.9784 0.1482 0.8113 3.7931 2.7532 0.2966 0.7861 2.1219 1.9299 1.3893 0.6638 0.1513 23.1573 18.9442 7.7426 67.9554 33.2291 6.1230 60.2246 18.3555 9.8505 30.4042 3.4265 39.5234 5.7223 5.9808 8.2823 2.1178 2.0138 2.7229 0.2244 2.8848 2.3064 16.8442 24.4118 31.7675 2.6422 34.8654 0.2099 20.5748 252.0436 145.1409 131.4197 15.3516 112.7008 2.7177 6.9397 24.5684 20.1588 2.0730 1.8007 128.6741 7.4626 28.2061 33.1096 3.0376 0.4885 3.4962 16.1263 3.7526 18.1791 7.0332 19.3132 1.9331 4.1609
temp: 298.150 k
press: 1.00000 atm
elementType: 8 8 8 7 6 6 6 6 6 6 6 6 6 6 6 6 6 1 1 1 1 1 1 1 1 1
symmnumber: 1
zpe: 496147.3 jmol-1
zpe.correction: 0.188973 hartree
zpe.thermalcorrener: 0.202591 hartree
zpe.thermalcorrenthalpy: 0.203535 hartree
zpe.thermalcorrgfe: 0.146973 hartree
zpe.sumelectzpe: -779.951297 hartree
zpe.sumelectthermal: -779.937679 hartree
zpe.sumelectthermalent: -779.936734 hartree
zpe.sumelectthermalfe: -779.993296 hartree
dipole: 1.9821 1.1170 1.8281
dipole: 2.9187
quadrupole: -92.5593 -105.0537 -96.3685
quadrupole: -23.2126 -4.7831 -1.1393
quadrupole: 5.4346 -7.0598 1.6253 -23.2126 -4.7831 -1.1393
hfenergy: -780.1402692 hartree
pointgroup: C01 [X(C13H9N1O3)]
dipole: -0.8327603 0.44586 -0.6529058 debye
dipolederiv: -0.8236081 0.0736533 0.0457212 -0.0618213 -0.8837809 -0.1848972 -0.0535594 -0.2348062 -0.3736613 -0.8853543 0.1155549 0.0889167 0.2253887 -0.4958715 0.0347848 0.0826459 0.03397 -0.2482499 -0.5223608 -0.0569672 0.0742995 -0.0042866 -0.7521418 0.1460491 0.0554341 0.1276667 -0.2586273 1.2734913 -0.2574195 -0.1380941 -0.4793733 1.4058176 -0.2333209 -0.1088948 -0.2111519 0.2590569 -0.5228858 0.0030258 0.0764847 -0.0132234 -0.2486668 0.0093418 0.0810237 0.0053733 -0.0332876 -0.5529367 -0.3265689 -0.0416531 -0.3657288 -0.3611649 -0.0481031 -0.0557682 -0.0685643 -0.022978 1.8720199 0.2692958 -0.0852679 0.4736738 1.0223997 0.2444988 -0.0328089 0.2717196 0.2346262 0.0790772 -0.1757903 0.0264607 -0.1161023 0.0133385 -0.0131591 -0.0975255 0.0157993 -0.0556473 0.1206993 -0.109674 -0.0218412 0.1094992 0.1233919 -0.0599241 -0.0002336 0.0072178 -0.0793828 -0.1957374 0.1768732 -0.0134176 0.2372763 -0.400972 0.0663877 -0.0040786 0.0844679 0.0431331 -0.0113524 -0.013404 -0.0951315 0.2662839 0.067924 0.004382 0.0033726 0.0577735 -0.0433335 0.091217 0.1678028 0.0250116 -0.0921964 0.0064847 0.1245562 -0.0873258 0.0369947 -0.0314478 -0.2170607 0.2467686 -0.0485481 0.2574181 0.023399 -0.077532 -0.041693 -0.0811477 -0.1103592 -0.0582712 0.0562242 -0.0318923 -0.2042197 0.1297349 -0.014509 0.0371122 -0.0599317 -0.0818938 -0.2660457 -0.0749256 -0.0112403 -0.0488927 0.0055415 0.1542276 0.0447764 0.1575664 -0.0166773 0.0530384 -0.0246053 -0.159913 -0.0504054 -0.2023015 -0.0295129 -0.1727592 -0.0286029 -0.0649414 0.0571187 0.1129365 -0.0361538 0.0948459 0.049491 0.0691763 -0.0451546 0.0701609 -0.0447843 0.1624602 -0.0216445 0.0181415 -0.0868046 0.0696631 0.0183895 0.0528882 0.0036211 0.1295372 0.1173774 0.0764663 -0.0054002 0.0353802 0.0391839 0.0273281 -0.0187334 -0.0027768 0.1491586 -0.001685 -0.0017871 0.1024939 0.0097271 0.0896742 -0.0085364 0.1372961 0.0086134 0.0641121 0.126483 -0.0205081 0.01318 0.0333469 0.0584958 -0.0964992 0.0154189 -0.0671511 0.0747476 0.0216273 -0.071887 0.0381071 -0.0689673 -0.0243852 0.0509899 0.0399723 0.054131 0.1361453 0.0473061 -0.0043416 0.0250847 0.025316 0.1387945 0.0013996 0.0213479 0.0037774 0.1643977 0.0964953 0.0060087 0.0415462 -0.0300465 0.0050082 -0.117372 0.027527 -0.1182567 0.0300534 -0.0561364 -0.0281522 0.1085476 -0.0208266 0.1095207 -0.0282222 0.1185561 -0.0279159 0.0587298 -0.0049767 -0.1169349 0.0045576 -0.1252612 0.0114211 -0.0399234 0.0011638 -0.0385479 0.1215734 unknown
polarizability: 220.7450769|16.7291585|174.2656138|-25.125041|7.6284081|87.0624463 unknown
InChI: InChI=1S/C13H9NO3/c15-13(10-5-2-1-3-6-10)11-7-4-8-12(9-11)14(16)17/h1-9H
charge 0 multiplicity 1
26 atoms
O  -1.524601 2.513943 0.621192
O  4.288594 -1.537265 -0.289041
O  2.297927 -2.487103 0.290486
N  3.019472 -1.476939 -0.063396
C  0.315703 1.174502 -0.127461
C  -2.132538 0.265154 0.012762
C  -1.146494 1.379066 0.191617
C  0.958608 -0.078029 0.016993
C  1.082664 2.31214 -0.501161
C  2.344793 -0.161478 -0.227187
C  -1.959589 -0.770247 -0.946695
C  -3.321582 0.297496 0.792702
C  2.465187 2.200119 -0.753902
C  3.115014 0.954232 -0.618181
C  -2.952304 -1.760152 -1.110587
C  -4.30313 -0.699838 0.63815
C  -4.120003 -1.7330 -0.313687
H  0.419897 -0.971769 0.341952
H  0.570816 3.277047 -0.575619
H  -1.072053 -0.785982 -1.587795
H  -3.451889 1.115739 1.508541
H  3.040709 3.082051 -1.051504
H  4.186314 0.833315 -0.798986
H  -2.816697 -2.548338 -1.858705
H  -5.209754 -0.674812 1.252043
H  -4.885164 -2.507451 -0.436631
