program: Gaussian 16
title: Title
version: ES64L-G16RevA.03
method: RB3LYP
basis: 6-31+G(d,p)
operation: Freq
keyword: #N
keyword: Geom=AllCheck
keyword: Guess=TCheck
keyword: SCRF=Check
keyword: GenChk
keyword: RB3LYP/6-31+G(d,p)
keyword: Freq
converged: YES YES YES YES
title: Mulliken charges:
elementType: C C H C H H H C H H C C H H H C H H H C H H C H H C H H C C C H H C H H C C H H C H H C H H C H H C H H H O H
charge: 0.162836 0.046259 0.117317 -0.656400 0.152192 0.150418 0.148529 -0.263413 0.133009 0.132600 -0.079882 -0.256306 0.167592 0.142012 0.144416 -0.561471 0.147048 0.149461 0.146605 -0.128018 0.133760 0.140468 -0.472404 0.135751 0.140935 0.010249 0.130115 0.138937 0.510295 -0.571575 0.038486 0.145290 0.139095 -0.727555 0.127850 0.153062 0.857623 0.071299 0.134819 0.141247 -0.512425 0.144012 0.143252 -0.936387 0.142773 0.141103 -0.501709 0.126218 0.119327 -0.576279 0.178028 0.138401 0.144998 -0.465864 0.342001
chargesum: -0.00000
title: Mulliken charges with hydrogens summed into heavy atoms:
elementType: C C C C C C C C C C C C C C C C C C C C O
charge: 0.162836 0.163575 -0.205261 0.002196 -0.079882 0.197714 -0.118356 0.146210 -0.195717 0.279300 0.510295 -0.445357 0.322870 -0.446643 0.976950 0.347365 -0.225162 -0.652511 -0.501709 -0.114852 -0.123863
chargesum: 0.00000
1716.lowfreq: -10.5456 -0.0009 -0.0003 0.0002 2.0338 3.4470 49.8579 71.1678 74.8729
frequency: 49.8510 71.1610 74.8682 117.6869 132.3400 165.9491 183.3944 206.8935 216.9380 242.2222 247.4041 261.5294 269.2405 277.2326 285.9462 298.0859 300.8316 307.5808 322.8890 332.0365 338.1956 344.2420 363.8261 385.3387 394.4567 406.7332 424.5616 430.7219 447.1505 458.7073 467.9336 488.3122 507.4235 525.5193 546.2480 566.4852 584.3445 591.9944 642.5005 685.4997 725.7533 737.1192 744.4000 789.1958 820.5099 826.3747 882.5119 891.6202 895.9183 904.5600 924.2668 933.5970 936.1829 944.2048 946.8758 954.0772 964.2679 973.8299 982.7798 999.6322 1008.2443 1024.1341 1031.0345 1035.8951 1039.8460 1042.7022 1054.7930 1063.7134 1078.6097 1093.1404 1106.6249 1113.9450 1130.4364 1141.5372 1155.9994 1172.9011 1184.8713 1186.0870 1200.0112 1207.0207 1229.2215 1238.5985 1242.8634 1252.7803 1265.4871 1285.1609 1297.0682 1306.7322 1312.7278 1317.3406 1337.8226 1347.0121 1357.2154 1364.1359 1366.5162 1374.5065 1377.0005 1382.3596 1386.3804 1391.1126 1398.7426 1403.3359 1409.3153 1417.2736 1419.9211 1426.1446 1432.2345 1453.7355 1483.3612 1485.8095 1488.1535 1489.1705 1490.6676 1498.3254 1501.7425 1504.7363 1506.5921 1509.0758 1511.6981 1514.6824 1516.5404 1519.5320 1525.1758 1528.0097 1696.6886 2985.3920 3007.1927 3010.7095 3021.0744 3023.0365 3027.6155 3027.9091 3029.7655 3030.5704 3035.7689 3041.0024 3042.7065 3054.3031 3055.4549 3060.0171 3061.9835 3063.2177 3067.3220 3072.9417 3080.3796 3092.9518 3095.8525 3103.6622 3104.5290 3110.1264 3115.1600 3116.6589 3125.9810 3128.2992 3129.8412 3152.8667 3161.1718 3232.5824 3827.8827
redmass: 3.7245 2.7941 3.1066 2.9959 2.4926 1.8223 2.2407 1.3853 3.8074 2.1069 1.6645 1.5712 1.5649 1.3297 1.6139 1.7771 1.6133 2.0510 2.3036 2.4793 2.6432 2.4394 2.4299 2.7554 2.5872 2.3087 1.9650 2.4908 2.3428 3.0702 2.8495 3.1897 2.6933 2.5192 2.3718 2.3467 2.3418 2.6348 2.4619 1.9631 3.0657 2.7352 3.0473 2.3411 2.1514 1.8767 1.7476 2.3015 2.0168 2.0772 1.7907 1.3771 1.8479 1.9264 2.0558 1.5393 2.1402 2.3269 1.6664 1.8512 1.7721 1.6961 1.9550 1.9018 1.6135 1.1617 1.8678 2.0318 1.9627 1.8023 1.9339 2.2309 1.8430 1.5675 1.9592 1.7428 2.4212 2.0590 2.1054 1.6446 1.7894 2.0728 2.2364 1.5866 1.5513 1.5753 1.3554 1.4589 1.5702 1.4160 1.2703 1.4152 1.4087 1.3775 1.3960 1.3467 1.4018 1.4412 1.4001 1.4523 1.5472 1.2845 1.2194 1.3844 1.3120 1.2693 1.2274 1.1820 1.0796 1.0761 1.0759 1.0552 1.0698 1.0850 1.0835 1.0750 1.0545 1.0582 1.0614 1.0748 1.0661 1.0672 1.0582 1.0573 4.3926 1.0814 1.0659 1.0723 1.0667 1.0605 1.0649 1.0709 1.0628 1.0628 1.0392 1.0407 1.0447 1.0877 1.0501 1.0664 1.0956 1.0984 1.1025 1.1006 1.0961 1.0910 1.1012 1.1023 1.0977 1.0998 1.0867 1.0931 1.0985 1.1006 1.1009 1.0637 1.0985 1.1153 1.0659
irintensity: 0.3005 0.0741 0.0148 0.6580 1.0186 16.0917 5.3237 0.7152 1.1965 11.0030 54.8571 23.8714 3.2794 0.0524 47.6133 21.9034 9.3496 11.8355 1.6109 3.9200 0.2262 1.8813 1.8854 2.6230 0.7235 2.0067 0.8777 1.2657 0.3556 0.2409 2.0859 0.8568 3.8560 0.5336 3.4736 0.0536 4.5046 3.4932 4.0844 11.4975 3.7582 1.3296 1.2532 0.1798 2.7611 0.3623 6.9491 8.8305 8.9939 7.9773 7.0229 58.1040 11.1569 5.7936 0.3246 1.2713 42.3808 11.7207 10.4815 4.0395 3.4520 3.0951 8.2691 10.0825 2.2299 17.7174 4.6235 12.0634 14.3482 5.4187 24.6268 2.9087 1.6533 5.4400 5.4195 2.0800 17.8285 4.1770 16.9434 3.1918 16.7936 5.8465 7.4014 2.5661 6.2401 2.4874 1.3861 27.3498 6.3879 2.8496 6.3616 2.2576 3.4078 3.8849 1.2320 2.4066 1.7763 1.2865 1.3295 0.8596 10.4613 4.6610 8.0013 3.4006 12.9398 6.9062 18.1371 4.3460 7.8417 0.8670 2.4356 1.9809 3.5031 12.9900 11.8463 6.3801 6.6616 6.1780 4.1386 4.3631 12.0907 2.8039 14.7799 12.2357 38.3322 23.9915 51.9153 14.5628 24.6516 30.1841 55.1311 45.2293 82.1186 63.5186 44.6555 39.6984 37.0868 95.3329 25.2023 68.8841 30.9420 24.4512 69.3332 131.0439 76.9552 60.6646 11.9420 43.9104 88.2360 77.8889 35.0712 62.8838 47.1883 40.7176 33.6131 14.0680 13.8694 20.7256 23.4154
temp: 298.150 k
press: 1.00000 atm
elementType: 6 6 1 6 1 1 1 6 1 1 6 6 1 1 1 6 1 1 1 6 1 1 6 1 1 6 1 1 6 6 6 1 1 6 1 1 6 6 1 1 6 1 1 6 1 1 6 1 1 6 1 1 1 8 1
symmnumber: 1
zpe: 1331875.1 jmol-1
zpe.correction: 0.507284 hartree
zpe.thermalcorrener: 0.528043 hartree
zpe.thermalcorrenthalpy: 0.528987 hartree
zpe.thermalcorrgfe: 0.461690 hartree
zpe.sumelectzpe: -857.465636 hartree
zpe.sumelectthermal: -857.444878 hartree
zpe.sumelectthermalent: -857.443933 hartree
zpe.sumelectthermalfe: -857.511231 hartree
dipole: 0.9539 1.5881 1.2695
dipole: 2.2457
quadrupole: -140.1968 -136.6401 -136.5147
quadrupole: 4.1446 1.7857 -4.0179
quadrupole: -2.4129 1.1437 1.2692 4.1446 1.7857 -4.0179
hfenergy: -857.9729207 hartree
pointgroup: C01 [X(C20H34O1)]
dipole: 0.3756705 0.6248607 0.4990696 debye
polarizability: 330.9387027|4.6901359|264.4586912|-3.1542475|-1.9068878|252.09658 unknown
InChI: InChI=1/20C.O.34H
charge 0 multiplicity 1
55 atoms
C  -3.44929668 0.00111372 0.29697275
C  -4.81241154 -0.10674327 -0.35801939
H  -4.7959987 0.05399278 -1.43842406
C  -3.53058283 -0.22668239 1.81727236
H  -4.19621022 0.5058132 2.28642806
H  -3.91012378 -1.22872293 2.04487805
H  -2.55090681 -0.12970944 2.29052329
C  -5.9904006 -0.37042648 0.21846313
H  -6.90043018 -0.42207998 -0.37305975
H  -6.09650135 -0.54399178 1.28525104
C  3.32762137 -0.40930867 0.46202707
C  4.31756976 -1.48067261 -0.0412366
H  4.4194795 -1.44576873 -1.12866142
H  5.30403053 -1.30803078 0.40458729
H  4.00453115 -2.49101716 0.23964223
C  3.19860552 -0.57788659 1.99442418
H  4.16850521 -0.37686244 2.46370541
H  2.47107543 0.10047951 2.44618133
H  2.91441789 -1.59890267 2.26409295
C  3.9367515 0.98360431 0.15250276
H  4.20326859 1.03290772 -0.91351654
H  4.88414355 1.08078684 0.69750203
C  3.00628937 2.15282762 0.4892354
H  3.47825724 3.09984564 0.20037524
H  2.84602885 2.20480811 1.57382757
C  1.65454034 2.00250632 -0.21805148
H  1.80261647 2.11264133 -1.30172016
H  0.99438244 2.82495285 0.07175428
C  1.93282536 -0.53999022 -0.28555834
C  0.9840413 0.64958531 0.09879012
C  1.26166015 -1.89650192 -0.01408301
H  1.89424485 -2.68752038 -0.42729895
H  1.20714657 -2.05660896 1.06754839
C  -0.15581916 -1.99790585 -0.58493069
H  -0.58586715 -2.96954479 -0.30949443
H  -0.13013582 -1.96399456 -1.67974483
C  -1.03143337 -0.87109379 -0.03009793
C  -1.38271388 1.57797161 0.29042311
H  -1.08884396 2.5935388 0.00289659
H  -1.21030258 1.50284236 1.37249707
C  -2.88390886 1.41870557 -0.00495797
H  -3.45133066 2.15761634 0.57473547
H  -3.06903162 1.65652349 -1.0594136
C  -2.51902166 -1.05867596 -0.36286286
H  -2.65584111 -1.03587755 -1.45146163
H  -2.83860592 -2.05761845 -0.03840619
C  -0.48900665 0.53227979 -0.43363006
H  0.88700407 0.59919544 1.1915331
H  -0.93646132 -0.92557965 1.06568003
C  -0.57301746 0.77392857 -1.95888885
H  0.06944775 0.09031732 -2.51277101
H  -1.59325513 0.65591904 -2.33059486
H  -0.26421107 1.796433 -2.20060686
O  2.17594214 -0.55652334 -1.71404856
H  2.49122416 0.31023378 -1.99862425
