program: Gaussian 16
title: Title
version: ES64L-G16RevA.03
method: RB3LYP
basis: 6-31+G(d,p)
operation: Freq
keyword: #N
keyword: Geom=AllCheck
keyword: Guess=TCheck
keyword: SCRF=Check
keyword: GenChk
keyword: RB3LYP/6-31+G(d,p)
keyword: Freq
converged: YES YES YES YES
title: Mulliken charges:
elementType: C C H C H H H C H H C C H H H C H H H C H H C H H C H H C C C H H C H H C C H H C H H C H H C H H C H H H O H
charge: 0.500245 -0.095341 0.120727 -0.449573 0.151397 0.148131 0.148624 -0.183114 0.134476 0.135369 -0.104261 -0.253548 0.141911 0.144328 0.167717 -0.562322 0.149253 0.146599 0.146846 -0.126006 0.134431 0.140051 -0.476840 0.135595 0.140816 0.051190 0.129588 0.138925 0.615899 -0.782750 0.022568 0.145104 0.139121 -0.766186 0.126785 0.152492 0.608789 0.009267 0.134926 0.140721 -0.537490 0.139645 0.151265 -1.065320 0.147025 0.139513 -0.408434 0.126832 0.118462 -0.551981 0.144644 0.176931 0.140689 -0.466303 0.342569
chargesum: -0.00000
title: Mulliken charges with hydrogens summed into heavy atoms:
elementType: C C C C C C C C C C C C C C C C C C C C O
charge: 0.500245 0.025386 -0.001421 0.086731 -0.104261 0.200409 -0.119624 0.148476 -0.200428 0.319703 0.615899 -0.655918 0.306793 -0.486909 0.727251 0.284913 -0.246580 -0.778781 -0.408434 -0.089716 -0.123734
chargesum: 0.00000
1716.lowfreq: 0.0003 0.0006 0.0008 5.5938 8.1156 9.6751 51.6918 70.0362 95.0714
frequency: 51.6880 70.0345 95.0679 120.4925 132.7713 149.1793 182.7269 204.4419 209.1401 240.4748 245.7500 253.5553 266.2485 271.7670 278.6614 290.0009 301.6821 309.0571 317.4335 334.2751 338.2121 359.7274 362.4134 385.3316 387.5517 400.0979 418.5520 441.7389 445.6004 465.5882 484.4684 488.6899 500.6302 533.4057 540.0435 559.7006 579.0681 593.4115 649.2350 691.8527 726.4195 738.9104 745.0810 789.2752 821.5785 828.3422 883.4902 892.8596 894.8871 907.3471 926.6687 933.9518 937.4071 944.4767 947.2016 954.0354 964.9106 973.7293 985.3848 1000.0475 1009.7054 1023.5976 1031.5962 1038.8976 1042.5674 1046.7777 1055.2206 1062.1515 1071.6915 1081.6772 1105.4630 1113.9289 1118.6283 1146.8012 1164.1763 1176.2966 1182.4741 1198.5598 1203.8506 1212.5567 1225.2194 1232.0741 1239.2564 1255.4737 1272.7394 1284.9014 1300.7199 1305.2571 1310.9199 1318.3280 1341.3100 1350.6920 1351.8005 1364.0716 1366.4633 1372.9642 1375.3948 1383.1063 1386.9352 1391.0388 1398.7678 1403.5571 1408.9976 1416.7752 1419.1864 1426.5580 1432.3917 1456.4062 1483.7062 1485.2801 1488.7462 1490.0502 1491.7301 1497.4378 1500.4066 1503.0949 1505.9841 1508.3706 1509.5689 1512.7583 1515.6258 1520.4605 1524.3104 1530.0986 1697.7607 2987.0575 3008.4007 3010.6681 3019.9901 3023.6303 3026.7423 3027.5569 3028.6777 3029.9374 3035.7138 3036.4716 3042.3559 3054.2511 3055.2155 3060.0731 3063.1046 3067.3868 3067.8066 3074.6293 3079.7254 3093.2597 3095.8155 3099.6265 3104.3796 3110.0878 3113.3782 3116.2793 3118.4083 3127.9207 3129.8841 3151.8837 3160.1391 3231.7243 3830.2526
redmass: 3.7832 2.8984 2.7521 3.0170 2.4306 2.9125 1.6399 1.8640 2.0119 1.8197 1.6895 1.4144 1.3715 2.0076 1.5414 1.9594 1.7703 2.2427 2.2994 2.5433 2.2734 2.2765 2.3523 2.3961 2.4513 2.2434 2.3245 2.4602 2.3701 2.8170 2.8500 3.2756 2.7816 2.5394 2.4636 2.5686 2.2850 2.7290 2.2900 1.9533 3.1136 2.7167 3.0935 2.3434 2.1346 1.8565 1.7421 2.2279 2.0421 1.9656 1.7696 1.3765 1.8295 2.2050 1.9644 1.5442 2.2340 2.2815 1.6442 1.7770 1.8644 1.6535 1.8159 1.6888 1.2792 1.8118 1.6768 1.7178 1.8964 1.9134 1.9923 2.2285 1.6592 2.3614 1.6696 1.8979 1.9723 2.0196 1.8400 2.1069 1.8386 1.8147 2.1591 1.5423 1.8696 1.4891 1.4367 1.5502 1.4218 1.3791 1.2764 1.3184 1.4464 1.3654 1.4118 1.3709 1.4089 1.4230 1.4603 1.4456 1.5593 1.2967 1.2206 1.2634 1.4161 1.2676 1.2294 1.1989 1.0703 1.0805 1.0510 1.0685 1.0772 1.0777 1.0766 1.0702 1.0539 1.0615 1.0653 1.0765 1.0858 1.0667 1.0579 1.0567 4.4230 1.0813 1.0653 1.0723 1.0655 1.0626 1.0671 1.0625 1.0656 1.0637 1.0392 1.0437 1.0450 1.0870 1.0496 1.0629 1.0981 1.1025 1.0991 1.0991 1.0963 1.0909 1.1012 1.1018 1.0975 1.0999 1.0850 1.0953 1.0999 1.1006 1.1009 1.0635 1.0986 1.1155 1.0658
irintensity: 0.1411 0.0129 0.0653 0.6341 0.7900 1.5002 10.9302 0.9801 0.2292 0.3024 0.2388 29.6554 32.3823 9.4102 2.9331 33.8474 37.3006 26.3419 10.3657 8.4525 2.6244 9.2254 0.9643 0.4706 1.1964 2.8877 1.9991 0.1703 0.6947 0.6344 2.0276 0.5681 2.6340 2.1448 0.4630 1.0123 2.3795 4.6572 2.0212 17.3343 3.3710 1.3186 0.5383 0.2324 2.7066 0.2795 5.2301 1.7697 16.0750 4.1206 10.5946 58.6110 6.2815 8.8726 1.2549 1.2075 44.1859 9.0032 9.6606 3.1446 9.1657 5.8166 3.4716 4.8428 14.0523 11.7017 4.3258 2.5357 25.5638 7.5052 25.3631 3.5368 0.9671 7.3651 3.3390 5.3147 1.9474 12.6287 4.8460 14.7745 13.3886 3.5075 3.8323 13.5939 1.4523 2.4535 1.7880 21.7701 10.4965 6.9145 5.7406 1.6606 3.5309 3.2771 3.0184 0.8595 2.2566 1.3248 4.5307 0.6585 8.1364 6.5093 8.5854 11.1700 5.9732 6.1320 17.7109 3.5227 0.2222 8.4221 2.7582 2.5155 1.6747 6.8115 3.9373 19.2515 5.5376 3.5900 6.8553 8.4222 8.0335 1.8005 16.2669 9.8671 35.9740 24.6394 50.1870 16.2795 25.0819 26.4552 58.5985 51.0545 28.9258 112.5369 36.7408 70.3280 36.2963 95.9622 26.8531 56.4640 17.5563 65.9664 36.7314 113.9349 98.9623 58.8861 11.7601 40.7186 86.6397 82.1776 49.0998 50.4846 58.9903 41.2532 32.6563 13.1818 14.1402 24.1771 22.6372
temp: 298.150 k
press: 1.00000 atm
elementType: 6 6 1 6 1 1 1 6 1 1 6 6 1 1 1 6 1 1 1 6 1 1 6 1 1 6 1 1 6 6 6 1 1 6 1 1 6 6 1 1 6 1 1 6 1 1 6 1 1 6 1 1 1 8 1
symmnumber: 1
zpe: 1331871.5 jmol-1
zpe.correction: 0.507283 hartree
zpe.thermalcorrener: 0.528063 hartree
zpe.thermalcorrenthalpy: 0.529007 hartree
zpe.thermalcorrgfe: 0.461780 hartree
zpe.sumelectzpe: -857.465306 hartree
zpe.sumelectthermal: -857.444525 hartree
zpe.sumelectthermalent: -857.443581 hartree
zpe.sumelectthermalfe: -857.510809 hartree
dipole: 0.8209 1.8601 1.3156
dipole: 2.4217
quadrupole: -138.7603 -135.4478 -137.8039
quadrupole: 2.7259 0.6492 -2.6555
quadrupole: -1.4229 1.8895 -0.4666 2.7259 0.6492 -2.6555
hfenergy: -857.9725887 hartree
pointgroup: C01 [X(C20H34O1)]
dipole: 0.3232803 0.7319995 0.517154 debye
polarizability: 316.5560055|7.2049891|273.6804707|8.0749934|5.7240463|253.623075 unknown
InChI: InChI=1/20C.O.34H
charge 0 multiplicity 1
55 atoms
C  -3.44534653 0.13784104 0.48911813
C  -4.89299687 0.05711521 0.04428877
H  -5.50625981 0.89336241 0.38849593
C  -3.45164799 0.06832236 2.03786765
H  -3.82587159 -0.90413928 2.37567869
H  -2.45340867 0.21166942 2.46013543
H  -4.10151572 0.84566434 2.45585665
C  -5.48094427 -0.89836023 -0.6837948
H  -6.53787165 -0.84145379 -0.9295529
H  -4.94292971 -1.76440522 -1.05813925
C  3.31001673 -0.40534957 0.42053726
C  4.25693049 -1.54497467 -0.0103156
H  5.26460472 -1.3513021 0.37540064
H  3.9368818 -2.51417457 0.38455305
H  4.31302031 -1.62237068 -1.09887279
C  3.24156265 -0.41639247 1.96603172
H  2.5479811 0.32188123 2.3752952
H  2.94734518 -1.3977901 2.34849836
H  4.23425026 -0.19377848 2.37394775
C  3.93296433 0.93467028 -0.05175939
H  4.15573926 0.870374 -1.12682644
H  4.90368538 1.06369444 0.44329039
C  3.03990582 2.15306299 0.20159335
H  3.51785487 3.05543838 -0.19879522
H  2.92485255 2.31615758 1.28089972
C  1.65772376 1.96471108 -0.43411113
H  1.76375277 1.96358433 -1.52840476
H  1.02590604 2.82705534 -0.20308946
C  1.88299254 -0.57778521 -0.25467031
C  0.97441593 0.66632563 0.04352423
C  1.1976478 -1.88342391 0.18081039
H  1.79692051 -2.72693509 -0.17403965
H  1.18599743 -1.93130862 1.27444428
C  -0.24445415 -2.00869345 -0.3188913
H  -0.6811717 -2.93663491 0.0724942
H  -0.2646625 -2.08776398 -1.41143037
C  -1.07429268 -0.81118006 0.15137079
C  -1.36319419 1.66632169 0.23089736
H  -1.0656799 2.63939898 -0.17535787
H  -1.14307364 1.70179708 1.30639279
C  -2.87859621 1.50737158 0.01983761
H  -3.40451566 2.31494872 0.54594518
H  -3.11370968 1.63474472 -1.04328451
C  -2.57790371 -0.99536919 -0.10347718
H  -2.75580027 -1.06473559 -1.18324942
H  -2.89572447 -1.95645468 0.32167364
C  -0.52153767 0.53055655 -0.41596454
H  0.92160386 0.72823105 1.13871625
H  -0.93365315 -0.75581426 1.24210426
C  -0.66465335 0.61757944 -1.95335086
H  -0.3325266 1.59758953 -2.3117488
H  -0.07046695 -0.1425831 -2.45943617
H  -1.70377859 0.50106707 -2.26915201
O  2.06612903 -0.74457656 -1.6825134
H  2.37046375 0.08589729 -2.06887455
