program: Gaussian 16
title: Title Card Required
version: ES64L-G16RevC.01
method: RmPW1PW91
basis: 6-31+G(d,p)
operation: Freq
keyword: #N
keyword: Geom=AllCheck
keyword: Guess=TCheck
keyword: SCRF=Check
keyword: GenChk
keyword: RmPW1PW91/6-31+G(d,p)
keyword: Freq
converged: YES YES NO NO
title: Mulliken charges:
elementType: C C C C C C H H H H H H C H H H C H H H C H H H C H H C H H C H C C H H H C H N H H H H H C H H C C H H H C H C H H Cl
charge: 0.243171 -0.049737 0.098251 -0.193810 -0.469261 -0.105242 0.211918 0.226397 0.212014 0.217446 0.206045 0.184600 -0.447631 0.183819 0.213346 0.185964 -0.590724 0.188864 0.215801 0.169062 -0.654478 0.246768 0.218807 0.230519 -0.818840 0.182745 0.174914 -0.604977 0.149882 0.166030 -0.354470 0.152635 0.740074 -0.664587 0.158731 0.182023 0.184733 -0.209021 0.118847 -0.990267 0.326176 0.323856 0.324976 0.267629 0.174270 -0.648180 0.164556 0.181876 0.620949 -0.665694 0.172361 0.168134 0.188481 -0.135599 0.151905 -0.488288 0.211729 0.197353 -0.046849
chargesum: 1.00000
title: Mulliken charges with hydrogens summed into heavy atoms:
elementType: C C C C C C C C C C C C C C C N C C C C C Cl
charge: 0.243171 0.162180 0.098251 0.244601 -0.045771 0.346987 0.135498 -0.016998 0.041616 -0.461181 -0.289065 -0.201835 0.740074 -0.139099 0.084097 -0.015260 -0.301747 0.620949 -0.136718 0.016306 -0.079206 -0.046849
1716.lowfreq: -2.8492 -0.0013 -0.0005 0.0023 2.0987 2.5788 7.6722 9.1598 14.8057
frequency: 7.5840 8.9160 14.7994 17.8081 27.9358 34.5610 35.8632 48.2659 49.6054 58.1422 70.1223 79.9798 98.4942 106.9948 119.6187 135.2058 141.7714 162.9953 172.2929 181.4299 196.2235 234.1110 247.2179 253.2995 261.1561 268.8969 279.2329 291.7605 299.0020 306.0685 318.1235 329.4234 345.7570 359.0868 394.3879 404.6910 419.0167 443.2949 452.6314 474.5688 495.7564 515.2098 522.8283 530.3073 566.8082 590.4607 603.4725 657.4604 721.5541 748.2355 769.0664 779.8101 792.3012 824.1483 832.2789 862.2223 882.7169 886.9284 908.6482 913.6771 939.4692 941.2545 954.8150 971.5657 980.4976 993.8244 996.3443 1002.7096 1022.1682 1029.0606 1041.3471 1045.0442 1053.8280 1058.9540 1069.0440 1072.4894 1074.0014 1104.7912 1118.2564 1126.6958 1142.0968 1142.4537 1144.2137 1171.7889 1176.6426 1188.3866 1196.1751 1233.2518 1254.8839 1257.0608 1259.0940 1278.0359 1282.4615 1288.2651 1295.1935 1299.7910 1312.7392 1318.0806 1328.5435 1355.7681 1365.6411 1369.2002 1373.8098 1393.3246 1395.1716 1398.4179 1402.8326 1411.8671 1427.8807 1429.3484 1432.7233 1437.6349 1475.1671 1477.5179 1483.4320 1484.8715 1486.1112 1487.2272 1489.8966 1494.2097 1495.5866 1498.5450 1505.6972 1506.1142 1506.2866 1511.4616 1515.5940 1518.1062 1523.2646 1529.4740 1687.7546 1688.6984 1744.8629 1754.2138 3025.4256 3028.2623 3049.8503 3054.0075 3056.7558 3063.3166 3064.6272 3073.5264 3078.7995 3090.4114 3092.1481 3098.5778 3102.5383 3102.5666 3105.8848 3108.0777 3109.8366 3120.9929 3121.7239 3123.0642 3123.9352 3154.0955 3154.4770 3159.1216 3160.4316 3165.4566 3166.2935 3172.7873 3175.1607 3176.8873 3179.2807 3180.6821 3201.1088 3210.8566 3518.4893 3651.8266 3652.3786
redmass: 6.4363 4.0294 4.1032 3.4220 2.6151 4.4392 1.1359 3.1975 1.9633 3.7821 2.8797 2.7305 3.9597 2.5166 2.0937 1.9783 2.6361 3.2925 1.1710 1.1729 2.8962 1.2458 1.1073 1.8309 1.5792 1.7825 1.7716 2.1556 2.1314 1.4400 1.9684 2.6922 2.8312 2.8081 2.3804 2.4823 2.3648 2.1275 2.9931 2.3920 2.6274 2.8520 2.6950 2.7511 2.5858 2.4126 2.4031 2.8339 4.3256 1.6137 1.3511 2.1080 2.1914 2.5476 2.4446 2.0790 1.5576 1.5550 1.6542 1.6228 1.9289 1.6650 1.5170 1.6769 1.6795 1.6722 1.3507 1.6713 1.9507 2.1429 2.0800 2.0823 1.8153 1.8106 1.5719 1.9790 1.5449 1.8593 1.8803 1.9102 1.5649 1.3336 1.2425 1.6181 1.2581 1.4116 1.4052 2.0717 1.8077 1.6047 1.4634 1.5621 1.4219 1.3118 1.2644 1.4180 1.1388 1.5338 1.1782 1.2357 1.3171 1.4302 1.5173 1.3080 1.4959 1.5581 1.5209 1.2655 1.2843 1.1921 1.4356 1.2726 1.1627 1.1874 1.0968 1.0574 1.0761 1.0705 1.1092 1.1937 1.1516 1.0834 1.1090 1.0924 1.0891 1.1528 1.1334 1.0980 1.0734 1.3559 1.0649 1.0644 6.8660 7.0705 1.0665 1.0540 1.0409 1.0604 1.0619 1.0578 1.0462 1.0365 1.0376 1.0903 1.0816 1.0987 1.0678 1.0619 1.0665 1.0986 1.0969 1.0804 1.0649 1.0983 1.1017 1.1030 1.1032 1.1017 1.1018 1.0992 1.1024 1.0895 1.0910 1.1092 1.1020 1.0974 1.1023 1.1027 1.0279 1.0894 1.0894
irintensity: 2.3370 0.6713 0.1580 0.3052 0.3604 0.6151 0.0124 0.3501 0.3906 0.8648 0.5769 1.0781 4.7017 0.7288 0.3926 1.3301 3.0828 2.0967 0.7948 0.3016 0.4224 7.4016 35.2514 1.7565 22.9444 19.9035 13.1686 1.5086 3.9268 1.6094 1.6020 0.8011 1.0122 2.0478 4.9043 1.5446 1.5978 0.4434 7.0235 1.6227 16.5707 35.2826 8.9946 2.7522 17.2397 9.7180 7.1165 35.3278 65.1091 12.0013 2.1601 7.2322 25.9620 12.0617 15.3927 0.7607 1.6942 18.7768 25.4383 24.8725 2.7390 1.7538 1.3790 3.3381 2.5860 18.4919 20.2077 4.4618 10.2885 4.4743 5.9918 3.5778 4.4759 10.8957 34.1456 1.3565 56.0798 20.6567 9.7241 8.1095 59.7508 3.7298 162.8412 11.9348 1.2134 57.1708 13.6859 0.8391 6.3107 3.3767 49.2962 8.4342 4.8458 15.0632 41.4911 22.4436 2.6069 10.3489 1.9488 10.4642 24.6535 8.1201 8.8683 8.3468 16.0263 2.8539 18.7447 29.4707 3.8018 27.3419 13.7228 8.4375 3.0140 7.4082 7.9048 2.9403 2.9375 2.7879 2.0031 15.6736 10.8364 15.8707 7.7484 14.0190 12.9639 13.9854 12.2880 9.9291 8.4780 17.2396 24.4307 24.2241 19.5136 3.9896 121.3770 20.9932 26.6944 2.8209 23.2791 25.7286 24.5737 8.8670 7.7454 16.4428 17.9395 10.7746 13.9064 3.8981 6.9260 17.9776 19.7623 1.5172 18.6889 14.9218 21.1040 1.7982 4.2546 17.3487 7.8059 5.2224 8.9281 27.2553 12.1119 3.3357 11.4156 12.4896 11.5176 2.5269 0.1559 11.4152 11.6315
temp: 298.150 k
press: 1.00000 atm
elementType: 6 6 6 6 6 6 1 1 1 1 1 1 6 1 1 1 6 1 1 1 6 1 1 1 6 1 1 6 1 1 6 1 6 6 1 1 1 6 1 7 1 1 1 1 1 6 1 1 6 6 1 1 1 6 1 6 1 1 17
symmnumber: 1
zpe: 1409505.5 jmol-1
zpe.correction: 0.536852 hartree
zpe.thermalcorrener: 0.566704 hartree
zpe.thermalcorrenthalpy: 0.567648 hartree
zpe.thermalcorrgfe: 0.468611 hartree
zpe.sumelectzpe: -1298.430511 hartree
zpe.sumelectthermal: -1298.400659 hartree
zpe.sumelectthermalent: -1298.399715 hartree
zpe.sumelectthermalfe: -1298.498752 hartree
dipole: -15.5868 -3.0177 0.7150
dipole: 15.8924
quadrupole: -80.1757 -122.3870 -132.6973
quadrupole: 24.6315 5.8419 0.0478
quadrupole: 31.5776 -10.6337 -20.9439 24.6315 5.8419 0.0478
hfenergy: -1298.9673629 hartree
pointgroup: C01 [X(C20H37Cl1N1)]
dipole: -6.1741566 -0.9667388 0.1986774 debye
polarizability: 316.9752362|-12.3249763|263.5520466|4.0790474|10.964303|211.2973733 unknown
InChI: InChI=1/20C.Cl.N.37H
charge 1 multiplicity 1
59 atoms
C  -4.02629157 0.06522059 0.14146383
C  -2.58022432 0.27310737 -0.6836395
C  -2.06107762 -1.07468769 -0.69807332
C  -2.73377618 -2.05251738 -1.55263287
C  -4.11639034 -2.29563297 -0.83443654
C  -4.83873697 -0.98142335 -0.62558742
H  -2.9462965 0.53201627 -1.68295698
H  -2.94401053 -1.64634602 -2.54506711
H  -2.18599909 -2.99277231 -1.63478301
H  -4.68285177 -2.97273386 -1.4783062
H  -3.94746009 -2.82154866 0.10939579
H  -5.13475996 -0.5666965 -1.59680421
C  -4.7487749 1.41170145 0.08672585
H  -4.82896004 1.79656594 -0.9331078
H  -5.76203308 1.25346975 0.46825176
H  -4.27698828 2.1676944 0.71559277
C  -3.80369784 -0.33288947 1.59866003
H  -3.18494204 0.3951194 2.12808405
H  -4.77749247 -0.36040162 2.09450664
H  -3.3510001 -1.31930441 1.72301201
C  -1.02129473 -1.5503239 0.22393927
H  -0.0976569 -1.61420845 -0.37513689
H  -0.82290759 -0.88533013 1.06194662
H  -1.21705508 -2.57267499 0.56000139
C  -1.69497418 1.38936995 -0.13529936
H  -2.29611643 2.29814612 -0.07205489
H  -1.35903321 1.17647172 0.88335968
C  -0.47566947 1.66730839 -1.03200419
H  0.18192134 0.79246932 -1.05116346
H  -0.82129142 1.81551979 -2.06293638
C  1.36684174 2.84443468 0.20355502
H  1.84737725 3.7908618 0.44944895
C  0.28935997 2.89504787 -0.59413163
C  -0.23811074 4.20282156 -1.11689291
H  -1.29433963 4.34929683 -0.8619515
H  0.31838741 5.05068221 -0.71429755
H  -0.17008993 4.24264977 -2.210091
C  2.02975161 1.63392666 0.78648444
H  1.41921004 0.73469997 0.65179755
N  -7.69784187 -1.04185232 1.36034459
H  -8.43560916 -0.86627138 0.6858169
H  -7.84304816 -1.98626475 1.70231293
H  -7.8781178 -0.42480219 2.14563395
H  -5.7642346 -1.14654978 -0.05444726
H  2.13039051 1.77795435 1.86883281
C  3.4230143 1.38173598 0.17551028
H  3.31443023 1.24837763 -0.90517329
H  4.03467092 2.28163636 0.31934222
C  4.1400544 0.19400187 0.76887657
C  4.61067945 0.35783319 2.18593657
H  3.76902242 0.4467555 2.88138222
H  5.23678843 -0.46447195 2.5305483
H  5.19485319 1.27906463 2.2810429
C  4.32995366 -0.90502348 0.01958426
H  3.98736191 -0.88766309 -1.01370805
C  5.01083686 -2.16233578 0.42666039
H  4.41013485 -3.03968176 0.1818823
H  5.2604159 -2.1963423 1.48484955
Cl 6.56485522 -2.38688087 -0.47607207
