program: Gaussian 16
title: Title Card Required
version: ES64L-G16RevC.01
method: RmPW1PW91
basis: 6-31+G(d,p)
operation: Freq
keyword: #N
keyword: Geom=AllCheck
keyword: Guess=TCheck
keyword: SCRF=Check
keyword: GenChk
keyword: RmPW1PW91/6-31+G(d,p)
keyword: Freq
converged: YES YES NO NO
title: Mulliken charges:
elementType: C C C C C C H H H H H H C H H H C H H H C H H H C H H C H H C H C C H H H C H N H H C H H C C H H H C H C H H Cl H H H
charge: 0.345274 -0.551063 0.818768 -0.359717 -0.407169 -0.493545 0.141493 0.168314 0.176670 0.154165 0.152628 0.182258 -0.566135 0.205037 0.175617 0.179568 -0.596537 0.214533 0.182464 0.165931 -0.653199 0.192299 0.167626 0.140063 -0.468146 0.150537 0.189374 -0.329613 0.139269 0.175558 -0.121996 0.113033 0.541157 -0.663206 0.178098 0.161945 0.180572 -0.696708 0.170502 -0.712230 0.362852 0.146529 -0.501312 0.148586 0.181658 0.598564 -0.681271 0.167793 0.182457 0.179247 -0.161812 0.148803 -0.510351 0.217237 0.197723 -0.058791 0.412221 0.413421 0.412960
chargesum: 1.00000
title: Mulliken charges with hydrogens summed into heavy atoms:
elementType: C C C C C C C C C C C C C C C N C C C C C Cl
charge: 0.345274 -0.409571 0.818768 -0.014733 -0.100377 -0.311287 -0.005914 -0.033609 -0.153212 -0.128235 -0.014786 -0.008962 0.541157 -0.142590 -0.379677 0.889224 -0.171068 0.598564 -0.151775 -0.013010 -0.095391 -0.058791
1716.lowfreq: -4.8481 -0.8712 -0.0025 -0.0016 -0.0015 0.8307 5.3359 8.7310 14.7613
frequency: 4.7278 8.5664 14.6801 21.7969 23.2298 25.9795 35.6290 37.4563 50.2182 54.5209 56.4943 58.9877 62.0068 71.1459 95.1513 105.7581 112.0890 125.0872 138.2341 141.8496 163.3006 169.3753 184.8049 205.6414 212.9650 242.6310 282.5429 301.2180 309.3115 318.9295 332.9637 355.3458 366.9595 374.7672 384.1660 399.6683 409.6135 434.8026 449.6437 453.3510 476.5040 488.2463 503.5637 512.5285 525.7562 564.8842 574.7476 584.1144 716.4640 746.1944 760.2639 790.6106 796.8610 804.8853 841.7949 858.3523 875.1832 900.4841 905.4614 908.0982 939.6785 942.8513 958.0377 966.9499 994.2788 999.6073 1007.9027 1016.1134 1016.9734 1022.0327 1031.7771 1051.7130 1057.4426 1059.1344 1066.4720 1068.8214 1092.5827 1110.6570 1118.6781 1136.7706 1142.9410 1174.9310 1176.3841 1183.2126 1192.8455 1214.5501 1245.1901 1247.9801 1257.8352 1269.7878 1275.1885 1282.8493 1295.5781 1311.3724 1332.3278 1343.5117 1365.9401 1370.0390 1374.3147 1387.7710 1392.2911 1399.3184 1410.9482 1418.3904 1424.6176 1429.3260 1430.2159 1431.3271 1432.4919 1472.1990 1474.8590 1477.8870 1479.7718 1482.5813 1484.1551 1485.2451 1489.3720 1489.9663 1494.1346 1495.4663 1496.8769 1498.0288 1500.4053 1504.6085 1506.3338 1507.0129 1517.8447 1536.6740 1708.6463 1723.7981 1731.8910 1747.7646 1751.1084 1753.0379 2473.8087 3034.4134 3040.3196 3048.8021 3053.5422 3054.4414 3054.5896 3056.6451 3060.2484 3061.8205 3063.2750 3066.0404 3101.3993 3102.6945 3107.6005 3109.5813 3117.0117 3118.7817 3122.5864 3122.6704 3122.8459 3124.8240 3128.2355 3130.1684 3141.8646 3144.2325 3160.4166 3164.3076 3176.1788 3176.3093 3176.5523 3178.6730 3181.8978 3203.4684 3475.4419 3592.9371 3594.5121
redmass: 5.5844 3.7396 3.2846 1.1382 3.6990 3.1796 3.1673 3.8932 3.3440 3.0804 3.0531 2.5360 3.0228 2.8268 1.6474 2.0158 1.2880 1.3860 1.4924 1.3154 2.6079 2.6318 2.6492 1.2117 2.7224 2.6686 2.3588 2.3842 2.3062 2.4367 2.9665 2.8985 1.1837 2.2448 1.8572 1.1155 2.1340 2.7828 2.5089 2.6001 2.4270 2.5862 2.4877 2.5054 2.6461 2.5087 2.0252 2.5947 4.7060 1.6896 1.8815 2.1584 2.3990 1.8375 1.8617 1.4431 1.3708 1.6769 1.6875 1.7144 1.6897 1.8584 1.4823 1.7061 1.5721 1.5819 1.9652 1.4102 1.8181 2.2752 2.4782 1.5458 1.5189 1.8669 1.8759 1.8893 1.6993 1.9083 1.8968 2.1702 2.4023 1.5879 1.3889 1.3690 1.1797 1.4582 1.2748 1.5953 1.6316 1.7167 1.4627 1.4358 1.2644 1.1353 1.3208 1.3503 1.5225 1.5156 1.4151 1.3499 1.2536 1.3047 1.3127 1.1662 1.4663 1.4492 1.2670 1.4101 1.4603 1.0669 1.0792 1.0895 1.0739 1.0792 1.0851 1.0964 1.0628 1.0780 1.0765 1.0763 1.0546 1.0632 1.0915 1.0844 1.0864 1.0836 1.1439 1.1354 3.0672 1.1978 1.0099 6.9303 7.1236 7.1183 1.0957 1.0682 1.0687 1.0612 1.0612 1.0608 1.0475 1.0392 1.0437 1.0609 1.0410 1.0408 1.1004 1.1000 1.0989 1.0978 1.0981 1.0964 1.0974 1.0976 1.0989 1.0630 1.0985 1.0898 1.0889 1.0913 1.0882 1.1023 1.0968 1.0976 1.0970 1.0910 1.0993 1.1029 1.0298 1.0931 1.0932
irintensity: 8.7686 2.9524 6.3820 1.1064 0.9345 2.7367 0.5260 3.5073 7.9158 1.9553 3.2757 0.8708 1.4355 3.0409 0.8929 0.6899 0.9224 0.7304 1.0718 0.4032 0.3962 20.6261 6.4272 26.6035 1.9651 35.1434 5.8520 2.4472 0.6957 1.2947 4.9078 4.0379 11.1346 1.9687 4.6990 1.9317 1.8415 12.4747 5.3217 8.8891 8.4401 4.5383 5.3091 2.3292 1.0682 6.2982 12.8258 4.6987 69.3104 2.5811 2.8986 3.6800 14.7727 6.2492 4.0734 4.7205 40.6551 13.4289 3.5407 1.9351 4.8513 1.8643 2.9366 11.9812 3.7934 7.0261 2.0189 9.9518 4.9904 5.0201 0.8936 3.0086 2.4518 4.2584 1.4366 7.6812 6.0264 22.3370 7.0096 13.8978 4.3043 3.2804 1.6961 4.7971 3.6063 3.2808 5.5120 10.5178 6.3481 1.5587 2.5980 8.5291 47.7814 2.1157 0.2922 1.5815 1.8725 1.6005 5.3594 5.0939 2.4671 1.6184 10.4574 71.2718 25.8409 5.0430 31.3433 5.3802 21.6805 2.1731 8.7498 4.5763 3.7967 1.4627 9.9921 10.3728 14.9302 0.2162 0.5760 21.5920 9.1965 10.6252 25.0406 5.4636 35.1206 18.7595 33.1425 70.7297 78.7285 22.1028 7.8218 25.9198 4.3703 0.8195 2684.1049 48.8223 7.2926 23.6422 6.0435 26.9888 36.3441 11.5515 32.6877 50.3302 16.7101 15.4920 30.0741 9.7962 13.6509 14.8981 14.8806 16.1908 11.1601 18.5591 15.4139 10.1907 10.7182 2.7635 16.2049 56.9035 11.8712 13.2863 14.3823 44.7961 3.7377 5.3286 12.5591 10.8686 104.8644 115.1208 111.5043
temp: 298.150 k
press: 1.00000 atm
elementType: 6 6 6 6 6 6 1 1 1 1 1 1 6 1 1 1 6 1 1 1 6 1 1 1 6 1 1 6 1 1 6 1 6 6 1 1 1 6 1 7 1 1 6 1 1 6 6 1 1 1 6 1 6 1 1 17 1 1 1
symmnumber: 1
zpe: 1407139.6 jmol-1
zpe.correction: 0.535951 hartree
zpe.thermalcorrener: 0.566876 hartree
zpe.thermalcorrenthalpy: 0.567821 hartree
zpe.thermalcorrgfe: 0.463813 hartree
zpe.sumelectzpe: -1298.424056 hartree
zpe.sumelectthermal: -1298.393131 hartree
zpe.sumelectthermalent: -1298.392186 hartree
zpe.sumelectthermalfe: -1298.496194 hartree
dipole: -20.7020 14.9367 -2.5996
dipole: 25.6600
quadrupole: -76.5412 -54.3306 -136.9194
quadrupole: -85.7665 -3.3528 -10.3175
quadrupole: 12.7226 34.9331 -47.6556 -85.7665 -3.3528 -10.3175
hfenergy: -1298.960007 hartree
pointgroup: C01 [X(C20H37Cl1N1)]
dipole: -8.3552277 5.6104553 -0.793953 debye
polarizability: 299.9885782|24.3388401|277.0164661|7.4740155|2.2344924|217.9608945 unknown
InChI: InChI=1/20C.Cl.N.37H
charge 1 multiplicity 1
59 atoms
C  -3.4203644 1.81839306 0.86070842
C  -2.87994445 -1.86986729 -0.49261826
C  -4.10127169 -1.39818499 -0.78995809
C  -4.26032804 -0.32145731 -1.83592217
C  -4.65274495 1.06615454 -1.27065398
C  -3.53354342 1.68418556 -0.48258248
H  -2.03386704 -1.44115878 -1.03057009
H  -3.33249376 -0.21700596 -2.40755075
H  -5.03827959 -0.61445701 -2.55157217
H  -4.89825494 1.70758122 -2.12876109
H  -5.56533536 0.97386399 -0.67472
H  -2.64413315 1.92614806 -1.06940592
C  -2.14500985 2.3239858 1.47570646
H  -1.69871322 1.53676479 2.09235631
H  -1.4067116 2.61674425 0.72651545
H  -2.32352502 3.16758859 2.15237557
C  -4.48689836 1.43193443 1.84385289
H  -4.15495137 0.55057271 2.40273778
H  -4.6481473 2.21958511 2.58787081
H  -5.44134827 1.18092399 1.38178186
C  -5.38293924 -1.91769767 -0.19924646
H  -5.94968951 -2.47678529 -0.95295194
H  -5.22093341 -2.58500533 0.64706668
H  -6.0379582 -1.10707414 0.13931916
C  -2.51511253 -2.95511765 0.47437075
H  -3.318772 -3.13003806 1.19498831
H  -2.3982989 -3.89985008 -0.0729424
C  -1.21498819 -2.66318949 1.24829252
H  -1.33729859 -1.73609845 1.81929247
H  -1.07629401 -3.4677008 1.98205273
C  0.72678971 -1.42380346 0.34284524
H  0.35162013 -0.59058186 0.94032138
C  0.02689798 -2.56846547 0.3934734
C  0.39726005 -3.82490723 -0.34515194
H  -0.30814053 -4.03409227 -1.15722654
H  1.39361034 -3.78105595 -0.78439912
H  0.36612929 -4.68860367 0.32767926
C  1.99073217 -1.12669333 -0.40584515
H  1.80064037 -0.33222454 -1.1407094
N  -4.61859583 4.45256006 -0.40063542
H  -4.18802241 3.47208319 -0.23221613
H  2.32309642 -1.99674852 -0.97651557
C  3.11386358 -0.64841236 0.53388053
H  2.74312794 0.19030311 1.13324509
H  3.34487962 -1.45820115 1.23772859
C  4.37568431 -0.2334406 -0.18071321
C  5.13162985 -1.33923792 -0.86135355
H  6.12617191 -1.04075559 -1.19213088
H  5.2505309 -2.18792134 -0.17992274
H  4.5893137 -1.71100994 -1.73757751
C  4.74900395 1.05651555 -0.17225066
H  4.1359943 1.7658698 0.38066447
C  5.94085136 1.64884308 -0.83192316
H  5.67094239 2.50616527 -1.45019121
H  6.49577531 0.94008401 -1.44238647
Cl 7.11387714 2.30048421 0.38998094
H  -5.63629103 4.39301751 -0.36526259
H  -4.29545237 5.10368708 0.31489627
H  -4.33656824 4.79785153 -1.31822629
