program: Gaussian 16
title: Title Card Required
version: ES64L-G16RevC.01
method: RmPW1PW91
basis: 6-31+G(d,p)
operation: Freq
keyword: #N
keyword: Geom=AllCheck
keyword: Guess=TCheck
keyword: SCRF=Check
keyword: GenChk
keyword: RmPW1PW91/6-31+G(d,p)
keyword: Freq
converged: YES YES NO YES
title: Mulliken charges:
elementType: C C C C C C H H H H H H C H H H C H H H C H H H C H H C H H C H C C H H H C H N H H H H H C H H C C H H H C H C H H Cl
charge: 0.439514 -0.114758 0.252264 -0.268469 -0.450334 -0.339998 0.131362 0.176608 0.189602 0.180345 0.168057 0.208544 -0.594098 0.194468 0.208204 0.233391 -0.632403 0.224264 0.216203 0.185278 -0.697319 0.203706 0.168176 0.155801 -0.413427 0.155572 0.152654 -0.479783 0.157512 0.175074 0.304961 0.119354 0.639965 -0.754864 0.155048 0.163246 0.183487 -0.993752 0.155131 -0.858490 0.368227 0.363554 0.364858 0.313899 0.177759 -0.172135 0.151944 0.164768 0.324971 -0.662996 0.185981 0.169659 0.176722 -0.194599 0.149660 -0.531653 0.221493 0.198779 -0.070984
chargesum: 1.00000
title: Mulliken charges with hydrogens summed into heavy atoms:
elementType: C C C C C C C C C C C C C C C N C C C C C Cl
charge: 0.439514 0.016604 0.252264 0.097742 -0.101932 0.182444 0.041964 -0.006659 -0.169636 -0.105201 -0.147197 0.424314 0.639965 -0.253084 -0.660862 0.238150 0.144577 0.324971 -0.130634 -0.044939 -0.111381 -0.070984
1716.lowfreq: -322.4546 -1.2356 -0.0028 -0.0013 -0.0008 1.8657 3.8398 9.6138 10.7971
frequency: -322.4546 9.3229 10.6728 12.9918 27.4168 33.8555 36.7873 38.9136 46.5789 52.3178 53.3861 70.5566 78.1855 81.1334 98.1631 106.8860 117.8132 133.8147 140.5103 140.9658 143.8950 159.2870 169.8869 191.5369 198.4000 233.1911 285.9402 295.6887 307.9818 316.4164 324.3710 353.6830 367.7143 387.9249 406.7229 416.6888 424.4556 452.9619 457.5118 468.6417 487.8930 493.6217 518.6527 521.8948 537.2805 560.3648 585.3102 591.4528 711.2844 748.8080 767.7528 786.2548 791.0378 811.5499 851.9608 861.9872 869.6939 882.5341 900.3912 903.9131 909.9010 934.4410 940.4817 942.0149 954.8804 969.0988 987.0446 999.0108 1002.5194 1014.1532 1022.1131 1030.1984 1044.1416 1051.6312 1055.6342 1060.5917 1070.1456 1087.4859 1105.2653 1117.2819 1129.9655 1139.0635 1175.9727 1176.4909 1181.4551 1186.9991 1229.2683 1240.8759 1250.2810 1251.1935 1255.7189 1259.4273 1283.2614 1283.4567 1291.3982 1295.8774 1312.7659 1336.6882 1343.1908 1365.4672 1369.6759 1374.9289 1385.8152 1392.6757 1398.0884 1399.4700 1404.2351 1413.5127 1416.4423 1429.9981 1431.4350 1432.7358 1458.5695 1464.5462 1475.9531 1478.4858 1482.2720 1484.4597 1485.9312 1489.8839 1491.8528 1493.8485 1495.2160 1495.3289 1497.8645 1501.4077 1505.0497 1507.6458 1510.9636 1618.6492 1673.4075 1676.6390 1731.3399 1747.6230 1756.9829 3023.0100 3037.1439 3054.5516 3055.5114 3057.9582 3059.6489 3062.8086 3063.4854 3066.5293 3072.6248 3087.0317 3104.5542 3105.1855 3111.7957 3115.8202 3116.1519 3123.4224 3125.1371 3129.3716 3129.4627 3130.7969 3131.7151 3135.7102 3139.2825 3146.8780 3150.2662 3176.1634 3176.8306 3179.9596 3180.2899 3185.3028 3206.2014 3219.0916 3507.5041 3643.6570 3645.2865
redmass: 2.2939 4.0308 5.2896 3.7821 3.8625 3.5018 2.8768 1.1110 3.3993 3.9851 3.2343 2.2090 2.7722 3.1351 2.4350 1.6552 1.6350 1.3417 1.5178 1.0990 1.5017 2.7976 1.4057 2.9800 2.4288 3.3258 2.2457 2.4052 2.2559 2.2967 2.8338 2.8552 2.7261 1.9790 2.1718 1.9784 1.2431 2.4186 1.6751 1.8168 2.5765 2.4644 2.2910 2.5115 2.1940 2.0300 2.4739 2.1806 4.4601 1.8625 2.2600 1.6870 2.2532 2.1683 1.5381 1.5755 1.6550 1.4220 1.9117 1.6326 1.6766 1.2112 1.6752 1.8545 1.4185 1.8957 1.6860 1.6126 1.9611 2.1792 1.8170 2.7520 1.7703 1.5616 1.6432 1.5783 1.7643 1.7926 1.9543 1.9566 2.0474 2.3303 1.3574 1.5178 1.4379 1.2275 1.2122 1.2076 1.2511 1.6984 1.5373 1.6616 1.4358 1.6512 1.1319 1.2912 1.1305 1.3509 1.3393 1.4280 1.5318 1.4937 1.2650 1.2389 1.2946 1.1876 1.2792 1.2464 1.2605 1.5061 1.4456 1.4614 1.0713 1.1175 1.0852 1.0886 1.0848 1.1116 1.0967 1.0807 1.1032 1.0720 1.0769 1.0918 1.1051 1.0692 1.0885 1.0837 1.0946 3.1706 1.0624 1.0577 6.7845 6.9488 7.0588 1.0708 1.0648 1.0561 1.0471 1.0467 1.0410 1.0460 1.0424 1.0605 1.0611 1.0613 1.1012 1.0941 1.0994 1.0986 1.0884 1.0996 1.1027 1.0622 1.0931 1.0901 1.0965 1.0907 1.1013 1.0894 1.0901 1.0988 1.0981 1.0902 1.0960 1.1041 1.1040 1.0998 1.0271 1.0916 1.0918
irintensity: 1855.9418 0.7582 3.7728 2.9724 0.0751 0.0718 0.7923 0.1071 1.1393 0.1303 1.1216 0.3284 1.8171 3.7992 1.2333 0.9998 0.4905 1.8099 1.4226 1.6374 14.9476 0.5834 21.4454 8.5375 5.2470 24.4939 13.3212 1.9968 1.6325 18.8793 36.3142 3.4535 50.4184 18.0102 0.9008 25.5312 16.8918 10.4187 2.0069 12.2012 7.8149 4.4684 10.0389 6.0725 58.4801 27.2545 1.5871 4.0514 62.5041 4.3005 18.1942 57.8214 27.7865 31.9863 52.7213 77.0145 2052.4112 418.7299 28.2760 41.3964 0.4156 250.5990 7.0274 1.7219 3.2347 57.1518 0.9609 20.4061 31.1034 10.7309 22.3474 1.4439 7.5458 28.1250 2.2239 2.9039 44.6925 58.3299 6.1694 40.1275 11.1209 7.6451 0.3600 9.1547 4.3059 1.7639 6.2853 5.1399 443.6812 56.1147 11.6898 0.8954 10.2731 5.2874 58.2994 44.5539 1.9092 13.4887 9.0787 19.1715 1.9642 3.4093 44.9399 2.1175 0.8157 54.7304 2.9042 94.4024 16.0581 0.9368 14.2647 24.2950 6.2252 8.1930 1.0337 12.8791 15.7499 17.9156 7.4495 25.3496 5.1028 29.3238 12.1053 6.7778 7.4772 7.1920 7.8656 14.6536 11.8664 117.8934 33.9485 30.2883 32.1304 20.7976 3.3865 40.1463 23.8606 33.9019 4.0151 39.0860 18.1124 11.8581 1.9324 25.7188 10.8212 27.3112 9.7530 20.2303 26.1985 13.1993 3.0370 12.8425 4.6916 10.2583 1.2363 6.9647 8.2894 2.8937 13.4087 10.3805 54.9287 23.4926 13.2746 9.8888 15.2017 3.5957 9.8871 4.4773 35.9092 45.0095 44.5204
temp: 298.150 k
press: 1.00000 atm
elementType: 6 6 6 6 6 6 1 1 1 1 1 1 6 1 1 1 6 1 1 1 6 1 1 1 6 1 1 6 1 1 6 1 6 6 1 1 1 6 1 7 1 1 1 1 1 6 1 1 6 6 1 1 1 6 1 6 1 1 17
symmnumber: 1
zpe: 1394563.1 jmol-1
zpe.correction: 0.531161 hartree
zpe.thermalcorrener: 0.561154 hartree
zpe.thermalcorrenthalpy: 0.562098 hartree
zpe.thermalcorrgfe: 0.462673 hartree
zpe.sumelectzpe: -1298.418330 hartree
zpe.sumelectthermal: -1298.388337 hartree
zpe.sumelectthermalent: -1298.387393 hartree
zpe.sumelectthermalfe: -1298.486818 hartree
dipole: -22.5337 -4.5630 -1.6741
dipole: 23.0520
quadrupole: -14.6537 -115.9433 -132.7599
quadrupole: 60.2291 10.4242 6.7084
quadrupole: 73.1320 -28.1577 -44.9743 60.2291 10.4242 6.7084
hfenergy: -1298.9494913 hartree
pointgroup: C01 [X(C20H37Cl1N1)]
dipole: 4.186811 6.1683516 5.1647747 debye
polarizability: 275.1409485|20.9028986|259.2180919|-16.9670945|31.5474457|280.2184245 unknown
InChI: InChI=1/20C.Cl.N.37H
charge 1 multiplicity 1
59 atoms
C  5.05437684 1.03981947 0.89248008
C  2.89003287 -0.94653135 -0.36695216
C  3.45433972 -0.39158811 -1.45699663
C  4.86095479 -0.76125516 -1.84480146
C  5.90969875 0.29009044 -1.40930551
C  5.98896918 0.36181337 0.10198572
H  3.48390554 -1.68999784 0.16832764
H  5.1334919 -1.72817369 -1.41097332
H  4.93401457 -0.8708932 -2.93270009
H  6.88667076 -0.00105017 -1.80725583
H  5.67520888 1.26467337 -1.84717366
H  6.34999127 -0.56401278 0.55994999
C  4.89005427 0.67864302 2.3254286
H  5.6237347 -0.05232859 2.66634376
H  4.90615727 1.56181835 2.97087096
H  3.89403391 0.23407206 2.44559953
C  4.3280145 2.25420494 0.44096132
H  3.28354771 2.20336505 0.76087644
H  4.75313276 3.12839496 0.95241476
H  4.36313368 2.41886156 -0.63275351
C  2.76739361 0.58217092 -2.37366031
H  2.487931 0.08205211 -3.30779414
H  1.86288772 1.0151832 -1.94673853
H  3.43031933 1.40643459 -2.65880312
C  1.50935635 -0.75098877 0.17793891
H  1.57207382 -0.30194227 1.18040154
H  0.93389462 -0.05099205 -0.43221985
C  0.74084234 -2.08324253 0.3222316
H  1.29770958 -2.74087254 0.99854706
H  -0.21503215 -1.8647953 0.81478426
C  1.08448113 -3.97675197 -1.22651011
H  1.74401025 -4.3671266 -0.44967372
C  0.48640272 -2.80056334 -0.98198234
C  -0.47214605 -2.11722739 -1.91640621
H  -0.10540302 -1.12900562 -2.21563541
H  -0.65578723 -2.68542788 -2.82762715
H  -1.43778222 -1.95621153 -1.42375114
C  0.98894169 -4.84149571 -2.4459532
H  0.2427062 -4.46695831 -3.15104425
N  8.31105362 1.86275205 0.41470685
H  9.06121771 1.21311051 0.19532348
H  8.36061335 2.62631708 -0.25400607
H  8.49630117 2.24480897 1.33801791
H  6.97624827 1.145788 0.3487152
H  0.657477 -5.84207422 -2.14311281
C  2.34754694 -4.95244627 -3.16471989
H  2.68199427 -3.94649273 -3.43766805
H  3.08588886 -5.34952282 -2.4538011
C  2.33326086 -5.83036748 -4.39080753
C  2.05639999 -7.28718313 -4.14952306
H  1.00596759 -7.45379895 -3.88756993
H  2.28424535 -7.91498452 -5.0107795
H  2.65341263 -7.65169306 -3.30710851
C  2.56668253 -5.28528831 -5.5956655
H  2.77408524 -4.21814843 -5.6463077
C  2.59066719 -5.98452756 -6.90554138
H  1.96997716 -5.47485591 -7.64336002
H  2.28266613 -7.02601001 -6.84876539
Cl 4.26304543 -5.98486694 -7.61576192
