program: Gaussian 16
title: Title Card Required
version: ES64L-G16RevC.01
method: RmPW1PW91
basis: 6-31+G(d,p)
operation: Freq
keyword: #N
keyword: Geom=AllCheck
keyword: Guess=TCheck
keyword: SCRF=Check
keyword: GenChk
keyword: RmPW1PW91/6-31+G(d,p)
keyword: Freq
converged: YES YES NO YES
title: Mulliken charges:
elementType: C C C C C C H H H H H H C H H H C H H H C H H H C H H C H H C H C C H H H C H N H H H H H C H H C C H H H C H C H H Cl
charge: 0.363666 -0.109476 0.421886 -0.296018 -0.456701 -0.532043 0.121185 0.168117 0.176460 0.156098 0.154131 0.181598 -0.573797 0.178970 0.180143 0.209134 -0.601787 0.216166 0.182864 0.164399 -0.658491 0.187616 0.166378 0.145115 -0.471202 0.170193 0.148313 -0.427813 0.154917 0.172942 0.266314 0.120595 0.621165 -0.764339 0.162779 0.160395 0.179386 -0.948850 0.153252 -0.701790 0.412795 0.411770 0.413215 0.360229 0.174805 -0.202966 0.154144 0.164875 0.336579 -0.666494 0.186580 0.167640 0.176751 -0.189793 0.150114 -0.534340 0.220897 0.198584 -0.077254
chargesum: 1.00000
title: Mulliken charges with hydrogens summed into heavy atoms:
elementType: C C C C C C C C C C C C C C C N C C C C C Cl
charge: 0.363666 0.011709 0.421886 0.048558 -0.146472 -0.350445 -0.005550 -0.038359 -0.159383 -0.152695 -0.099954 0.386909 0.621165 -0.261779 -0.620793 0.896218 0.116053 0.336579 -0.135523 -0.039678 -0.114860 -0.077254
1716.lowfreq: -3.6205 -2.1938 0.0005 0.0014 0.0027 2.0325 7.2467 8.3340 12.0141
frequency: 7.2106 8.3001 11.9605 15.5107 25.1818 28.2284 29.2690 45.2742 47.5158 48.7875 55.4531 60.4767 72.0653 73.1663 95.0276 115.7486 119.8824 124.1413 138.4054 140.2898 154.7798 183.3073 200.9098 205.4161 209.0982 255.3797 292.1495 295.4483 306.1581 317.4808 337.8931 353.1305 367.7017 380.0804 386.9204 399.4129 408.8142 431.7607 453.4651 460.9469 472.8756 492.2750 499.6954 513.5180 519.7819 552.8515 581.2847 585.6285 708.0130 748.8277 769.7176 786.9763 793.6722 811.6636 847.8369 857.4012 878.9058 897.2580 903.6805 912.6034 940.4586 942.3466 960.2053 972.9696 986.8047 997.3254 1004.7050 1014.7696 1018.2204 1024.7473 1030.1164 1045.3428 1054.0115 1059.0792 1060.4263 1070.8625 1092.7531 1104.1714 1122.7930 1135.9617 1138.4567 1175.9285 1177.6305 1182.0193 1187.3223 1236.6351 1247.6720 1251.8652 1255.9105 1256.8153 1271.1253 1283.1444 1295.2166 1312.8576 1332.4067 1342.8454 1369.0218 1372.6157 1375.7489 1387.1421 1392.6685 1397.5372 1405.6333 1419.0401 1424.6306 1429.3047 1430.3373 1431.0479 1432.6368 1472.9512 1475.6693 1477.9483 1479.3131 1482.5361 1485.1317 1486.4709 1489.3362 1492.5137 1494.3733 1495.3917 1495.7044 1500.0319 1501.8998 1505.5577 1506.9362 1507.5776 1517.9592 1536.2021 1707.9566 1724.1973 1731.9102 1746.6171 1754.5306 1757.1771 2480.3258 3035.9017 3037.2904 3042.0923 3053.0518 3054.0130 3057.1187 3057.1983 3062.6470 3063.2111 3065.8565 3066.3140 3102.0240 3105.8059 3106.5400 3109.3831 3112.4616 3122.5035 3122.6666 3123.7197 3128.7592 3129.0774 3129.5856 3130.8125 3140.6848 3149.2559 3151.5074 3164.2169 3175.1039 3177.4257 3178.9806 3180.2710 3181.0001 3206.6247 3475.1456 3592.3399 3594.5692
redmass: 4.4572 4.2167 3.9882 3.7152 1.1562 3.1601 3.1113 3.3305 3.5820 3.4768 3.4032 2.8767 2.5279 2.4781 2.4283 1.4395 1.2504 1.7889 1.2955 1.2691 2.3480 2.8678 2.3198 1.1857 3.1739 3.1842 2.3699 2.4350 2.3271 2.1870 3.0257 2.8336 1.1893 2.1940 2.0375 1.0909 2.1584 2.3371 2.7795 2.4652 2.6394 2.4866 2.4965 2.4579 2.7684 2.1426 2.3911 2.4404 4.5202 1.8192 2.1357 1.8044 2.1832 2.2731 1.5064 1.5338 1.3856 1.8987 1.6332 1.6723 1.6441 1.8435 1.3930 1.8086 1.6770 1.5996 2.0614 1.3086 2.4405 1.7583 2.6646 1.7963 1.6392 1.5291 1.6255 1.8532 1.7016 1.9235 1.9135 1.9855 2.2948 1.3487 1.5941 1.4631 1.2409 1.2391 1.3715 1.7603 1.5984 1.5701 1.6668 1.4326 1.2931 1.1301 1.3277 1.3149 1.5374 1.4857 1.4461 1.3406 1.2359 1.2892 1.2833 1.1668 1.4697 1.5099 1.2193 1.4461 1.4590 1.0676 1.0802 1.0818 1.0817 1.0658 1.0970 1.0898 1.0611 1.0795 1.0891 1.0810 1.0506 1.0908 1.0678 1.0880 1.0855 1.0840 1.1439 1.1355 3.2075 1.1768 1.0100 6.9282 7.1091 7.0717 1.0954 1.0678 1.0651 1.0673 1.0465 1.0548 1.0390 1.0465 1.0493 1.0611 1.0567 1.0407 1.1006 1.0987 1.0938 1.0970 1.0994 1.0980 1.0985 1.0995 1.0988 1.0919 1.0624 1.0972 1.0889 1.0894 1.0893 1.1023 1.0990 1.0967 1.0964 1.0896 1.0995 1.1040 1.0299 1.0931 1.0932
irintensity: 4.0864 5.6801 1.1426 8.5549 1.4554 1.2216 2.3482 1.8518 2.0892 4.1544 7.3805 4.3828 1.6603 1.0658 1.8114 0.1434 0.6785 3.7702 1.6914 0.5872 0.6985 21.4321 0.2251 19.6252 25.6740 15.2279 5.3531 2.1492 0.1116 0.9375 15.5483 4.7483 11.5349 2.7153 2.5858 2.4409 1.6890 9.9191 8.9550 1.8243 8.9463 2.0429 5.1101 2.3850 4.0020 1.5610 16.7187 2.3932 68.9125 4.3504 1.1966 12.7713 7.1439 0.4361 2.5376 4.8425 45.3243 3.2061 18.7746 4.7704 4.3429 4.0112 2.5066 8.1857 0.7664 3.7467 0.9079 9.3971 5.9051 4.4420 2.6929 5.2144 9.6665 1.4558 0.8000 12.0986 5.8016 2.5490 3.5870 7.7598 13.9173 0.6631 7.3064 4.2252 1.3721 0.2496 9.1554 3.7464 10.5368 2.2159 0.9905 9.8692 43.0945 1.8631 0.0080 0.4346 2.4722 8.1707 1.7312 2.8192 2.3147 3.0160 1.7437 74.9453 27.6294 1.8404 32.8930 12.1816 20.0951 2.1575 1.8730 10.5822 8.2341 1.9050 3.3783 2.9345 14.5492 5.0851 16.4680 9.3798 12.4304 16.1734 7.3527 19.2143 36.0152 14.6562 37.9524 76.1514 76.9802 20.2497 7.9346 23.4303 2.6149 2.6351 2641.1913 47.8824 21.9539 11.5937 50.7899 26.5369 12.1123 48.1271 7.9434 36.9530 31.9071 12.8502 9.5666 20.8157 17.6644 11.4500 18.8943 15.5092 5.7008 13.2507 11.5009 9.8143 10.9731 9.5855 13.1179 2.9715 61.6201 13.0311 23.6585 21.6889 14.5367 6.3200 13.2240 9.8313 104.2329 115.5590 113.8744
temp: 298.150 k
press: 1.00000 atm
elementType: 6 6 6 6 6 6 1 1 1 1 1 1 6 1 1 1 6 1 1 1 6 1 1 1 6 1 1 6 1 1 6 1 6 6 1 1 1 6 1 7 1 1 1 1 1 6 1 1 6 6 1 1 1 6 1 6 1 1 17
symmnumber: 1
zpe: 1407653.5 jmol-1
zpe.correction: 0.536147 hartree
zpe.thermalcorrener: 0.566983 hartree
zpe.thermalcorrenthalpy: 0.567928 hartree
zpe.thermalcorrgfe: 0.464253 hartree
zpe.sumelectzpe: -1298.424756 hartree
zpe.sumelectthermal: -1298.393919 hartree
zpe.sumelectthermalent: -1298.392975 hartree
zpe.sumelectthermalfe: -1298.496650 hartree
dipole: 25.2720 10.2949 -1.9001
dipole: 27.3545
quadrupole: 8.1658 -95.5701 -135.5435
quadrupole: 93.7871 -11.4519 -8.2852
quadrupole: 82.4818 -21.2542 -61.2276 93.7871 -11.4519 -8.2852
hfenergy: -1298.9609028 hartree
pointgroup: C01 [X(C20H37Cl1N1)]
dipole: -9.7725395 -4.4087228 -0.9397649 debye
polarizability: 284.5773488|-17.9990329|279.5165375|-3.3822844|-9.7621077|223.3833399 unknown
InChI: InChI=1/20C.Cl.N.37H
charge 1 multiplicity 1
59 atoms
C  -5.16463126 -0.80352057 -0.52510239
C  -1.92197381 1.31289934 0.06696797
C  -1.93794825 0.24493656 0.87983889
C  -1.75155354 -1.13998132 0.30899919
C  -3.03724193 -2.00367289 0.2886523
C  -4.02404262 -1.50587091 -0.72853903
H  -1.77431114 1.11972446 -0.99684454
H  -1.35740023 -1.07455282 -0.71019789
H  -1.00268647 -1.68163494 0.89948432
H  -2.73468893 -3.02989029 0.03751408
H  -3.47047605 -2.03838503 1.29266972
H  -3.695171 -1.60413466 -1.76600006
C  -5.93926609 -0.24628861 -1.68672519
H  -5.51730762 -0.53917529 -2.65017877
H  -6.99444854 -0.54045467 -1.65325638
H  -5.9327767 0.84790588 -1.63981809
C  -5.71956353 -0.46374154 0.82751304
H  -5.60599293 0.61175532 1.00014087
H  -6.79423035 -0.66868751 0.88055958
H  -5.22022852 -0.97683162 1.6491345
C  -2.08182042 0.30660595 2.37560589
H  -1.18034123 -0.08055687 2.86422037
H  -2.25446252 1.31692195 2.74525991
H  -2.91404355 -0.31262043 2.73028829
C  -2.03390151 2.76534297 0.41685954
H  -2.99471712 3.1539991 0.05246052
H  -2.03841203 2.91625112 1.49909367
C  -0.91656058 3.61048906 -0.22941628
H  -1.01048668 3.54931285 -1.31912948
H  -1.09005157 4.66002691 0.04113542
C  1.33732975 2.73858941 -0.74443038
H  0.97289496 2.67150969 -1.77070441
C  0.48074127 3.20752296 0.17594333
C  0.80444724 3.382672 1.63298175
H  0.19841407 2.71575025 2.2564958
H  1.85060275 3.18347561 1.86364063
H  0.58020045 4.40560068 1.95576697
C  2.74257865 2.25466189 -0.55467749
H  3.10497832 2.4501503 0.4577632
N  -5.7516721 -3.91762438 -0.72571765
H  -5.2279012 -4.53141841 -1.35004691
H  -5.73756332 -4.30981947 0.21584282
H  -6.71688719 -3.85636339 -1.04968406
H  -5.29849001 -2.93338088 -0.71897426
H  3.40347458 2.80460818 -1.23548616
C  2.85559482 0.74499432 -0.84416889
H  2.16361706 0.21137901 -0.18509082
H  2.51577874 0.56274245 -1.87351779
C  4.24416497 0.17948305 -0.68501354
C  5.27809022 0.7032856 -1.64083936
H  5.55224767 1.73611148 -1.40039927
H  6.1939716 0.11245625 -1.64887295
H  4.88029446 0.71226468 -2.66094852
C  4.47858589 -0.7373745 0.2680457
H  3.64575074 -1.053682 0.89303186
C  5.77140327 -1.39976006 0.5744904
H  6.00657239 -1.34940175 1.63819386
H  6.61077379 -0.99931648 0.01073616
Cl 5.70496291 -3.17690302 0.19290903
