program: Gaussian 16
title: Title Card Required
version: ES64L-G16RevC.01
method: RmPW1PW91
basis: 6-31+G(d,p)
operation: Freq
keyword: #N
keyword: Geom=AllCheck
keyword: Guess=TCheck
keyword: SCRF=Check
keyword: GenChk
keyword: RmPW1PW91/6-31+G(d,p)
keyword: Freq
converged: YES YES NO YES
title: Mulliken charges:
elementType: C C C C C C H H H H H H C H H H C H H H C H H H C H H C H H C H C C H H H C H N H H H H H C H H C C H H H C H C H H Cl
charge: 0.038380 -0.159754 0.204780 -0.403406 -0.509343 -0.133448 0.219728 0.225595 0.209168 0.216534 0.203855 0.182996 -0.420469 0.182651 0.210555 0.183904 -0.494764 0.184988 0.214474 0.168462 -0.616909 0.249604 0.232099 0.223845 -0.267615 0.180647 0.161686 -0.539370 0.176444 0.187803 0.150482 0.131406 0.391583 -0.690587 0.142725 0.168325 0.198188 -0.677406 0.174962 -0.988196 0.323894 0.323512 0.325770 0.268807 0.144753 -0.529566 0.159292 0.182583 0.543319 -0.691268 0.173966 0.180798 0.174894 -0.117762 0.155221 -0.497615 0.221163 0.196312 -0.052674
chargesum: 1.00000
title: Mulliken charges with hydrogens summed into heavy atoms:
elementType: C C C C C C C C C C C C C C C N C C C C C Cl
charge: 0.038380 0.059974 0.204780 0.031357 -0.088954 0.318355 0.156641 0.073159 0.088638 0.074718 -0.175122 0.281887 0.391583 -0.181348 -0.357691 -0.015020 -0.187691 0.543319 -0.161610 0.037459 -0.080140 -0.052674
1716.lowfreq: -18.1450 -0.7472 -0.0028 -0.0026 -0.0022 0.3433 4.0274 9.5434 14.7422
frequency: -18.1396 9.4898 14.7322 22.7474 24.5295 28.7848 32.2206 41.4167 48.4146 51.6548 65.3657 84.6839 96.6711 98.0827 122.0302 134.6885 137.1175 162.3698 170.5966 183.6077 195.8948 232.0175 243.8038 256.3150 266.2081 281.0855 287.7756 293.7045 296.2030 307.7095 316.5617 343.0205 357.4980 373.7836 393.2948 410.7641 432.1165 448.8095 451.7908 461.9747 494.6657 518.1320 518.6591 539.9859 566.1277 581.2237 588.2119 635.4667 717.2326 750.5538 777.4140 796.7298 802.5183 815.1104 838.0662 856.5812 881.3356 906.1649 910.2876 931.3017 940.9665 944.2058 949.9419 957.1070 980.3648 994.2155 998.5185 1003.3211 1014.7250 1023.5711 1028.3650 1035.5503 1054.7269 1059.6501 1063.9925 1069.9381 1070.9501 1105.8290 1110.9470 1133.7293 1135.3496 1141.8495 1143.8306 1176.9010 1183.2512 1189.9647 1208.7488 1236.1478 1248.7575 1255.5287 1260.6173 1262.3421 1273.2443 1283.3488 1288.8386 1297.0369 1313.3563 1318.1418 1343.9187 1361.6723 1369.6831 1372.0542 1379.0860 1394.2111 1397.5610 1401.2605 1408.8101 1412.5093 1427.6970 1430.9832 1433.9829 1437.8732 1478.5948 1478.9180 1479.6362 1485.1810 1486.9266 1489.3154 1491.3610 1495.0022 1498.0493 1499.3087 1502.0533 1505.7463 1506.6682 1508.8827 1512.5127 1518.4901 1521.4536 1529.5856 1687.6616 1688.4981 1746.4444 1750.0227 3021.8436 3023.9230 3048.1093 3055.5216 3058.8475 3060.5772 3063.4819 3074.3315 3077.9459 3091.1559 3093.6035 3101.6850 3102.5927 3107.1657 3108.1012 3109.8941 3118.6377 3119.2850 3128.2682 3131.3223 3131.3990 3145.7396 3147.5417 3153.6170 3156.2769 3160.0284 3162.7341 3174.5582 3178.3437 3179.7498 3182.1116 3182.8209 3202.0126 3203.9504 3518.9718 3652.5531 3652.9899
redmass: 3.5484 5.6059 3.6535 2.8915 1.2733 4.1100 2.7930 3.2092 3.2577 3.4944 2.6591 2.6953 2.0185 4.0748 1.3239 2.0294 2.1043 2.4683 1.9911 1.3957 2.7921 1.1903 1.0750 1.4613 1.2476 1.8271 1.8809 2.0190 2.3458 2.3514 2.7418 2.3312 2.8271 2.2834 2.1523 2.4102 2.6952 2.8490 2.3993 2.2627 2.5568 2.6574 2.5898 2.6635 2.3456 2.4129 2.4280 2.5481 4.6013 1.6649 2.3531 2.1767 1.7859 2.5744 2.5413 1.6640 1.7666 1.5628 1.5365 1.7337 1.6989 1.9219 1.6468 1.6504 1.7072 1.6564 1.5647 1.5211 1.6795 2.2123 2.3462 1.8135 1.6915 1.6448 1.8184 1.9671 1.4654 1.8573 1.9239 1.4582 1.4192 1.1996 2.2030 1.4422 1.3445 1.5061 1.2515 1.8699 1.5537 1.5070 1.5884 1.6206 1.4499 1.4292 1.3421 1.2466 1.1302 1.5015 1.2638 1.2294 1.4536 1.4852 1.5015 1.2528 1.4095 1.3021 1.3818 1.3774 1.2720 1.4545 1.4544 1.2856 1.1267 1.0971 1.1328 1.0950 1.0587 1.0734 1.1700 1.0673 1.1631 1.1121 1.1304 1.0935 1.1732 1.0849 1.1621 1.0700 1.0868 1.3534 1.0649 1.0644 6.9561 6.9469 1.0556 1.0668 1.0648 1.0432 1.0595 1.0468 1.0615 1.0361 1.0375 1.0910 1.0808 1.0678 1.0691 1.0611 1.0983 1.0971 1.0962 1.0992 1.0619 1.0760 1.0919 1.0941 1.1007 1.1040 1.1020 1.1021 1.1017 1.1025 1.0985 1.1096 1.0965 1.0908 1.1061 1.1033 1.0279 1.0894 1.0894
irintensity: 1.2654 0.8418 0.1360 1.1678 0.0350 0.2897 0.5568 0.2114 0.5592 2.2308 0.6470 1.3084 1.2163 3.7081 0.3149 1.4127 2.1742 1.0115 0.3365 1.5408 1.8715 6.1482 39.3148 7.9918 35.5910 4.6201 0.9249 5.5202 3.0803 1.1358 0.8279 2.8764 3.4547 2.9070 4.4581 2.8885 1.8204 7.8045 4.8835 3.7305 11.0977 27.0126 23.4176 1.5254 5.8902 13.8003 17.2771 32.0404 60.9275 2.3391 10.5755 14.4633 7.6912 22.7364 3.1052 4.0887 19.2296 7.9980 12.4828 10.2377 9.7447 1.6567 2.0690 4.7682 2.5963 7.6770 15.2774 6.6033 7.1404 0.5688 0.6329 23.6747 1.7677 0.7836 2.2196 3.9066 81.9454 37.5624 10.3830 5.0318 13.4193 201.3946 19.5693 0.4610 5.6466 44.9693 8.1932 0.2786 1.0604 12.3027 6.4693 44.4221 11.7634 7.7831 18.3028 48.0440 3.6636 10.0773 3.7283 21.9548 5.3417 5.0624 3.9230 0.6763 8.2627 7.1408 17.1377 62.5358 23.7970 3.5568 20.0333 17.8232 1.8325 3.6216 6.5641 4.2859 0.7174 4.0330 19.0931 15.0103 8.0900 2.8877 28.8355 5.3441 12.2818 14.0938 1.6369 6.7909 24.7944 19.6914 24.8155 24.3426 5.1578 17.8527 52.8287 90.7297 0.5141 29.6310 34.0286 20.8650 16.0407 10.5647 6.2724 20.7774 10.2321 6.4450 17.6864 0.7989 5.5901 21.4821 17.8270 16.4389 10.2123 1.5653 3.8635 20.0440 34.4381 4.1947 8.0126 14.9258 4.5178 12.0731 21.2663 3.3460 14.5549 4.5574 0.1498 10.5041 0.0909 11.1546 11.3995
temp: 298.150 k
press: 1.00000 atm
elementType: 6 6 6 6 6 6 1 1 1 1 1 1 6 1 1 1 6 1 1 1 6 1 1 1 6 1 1 6 1 1 6 1 6 6 1 1 1 6 1 7 1 1 1 1 1 6 1 1 6 6 1 1 1 6 1 6 1 1 17
symmnumber: 1
zpe: 1409658.4 jmol-1
zpe.correction: 0.536911 hartree
zpe.thermalcorrener: 0.565835 hartree
zpe.thermalcorrenthalpy: 0.566779 hartree
zpe.thermalcorrgfe: 0.471381 hartree
zpe.sumelectzpe: -1298.430046 hartree
zpe.sumelectthermal: -1298.401121 hartree
zpe.sumelectthermalent: -1298.400177 hartree
zpe.sumelectthermalfe: -1298.495576 hartree
dipole: 18.0398 -0.7979 4.0033
dipole: 18.4959
quadrupole: -81.7851 -117.0391 -126.7773
quadrupole: 21.7461 -2.9293 -2.7787
quadrupole: 26.7487 -8.5053 -18.2434 21.7461 -2.9293 -2.7787
hfenergy: -1298.9669565 hartree
pointgroup: C01 [X(C20H37Cl1N1)]
dipole: -7.1048325 0.2785493 1.5479183 debye
polarizability: 303.2370109|-12.9766969|252.8269443|6.2986796|5.3979422|221.6691436 unknown
InChI: InChI=1/20C.Cl.N.37H
charge 1 multiplicity 1
59 atoms
C  -3.92044208 -0.51896243 -0.49509104
C  -2.6530899 0.50447726 -0.11589285
C  -2.92388117 0.82300765 1.26461684
C  -2.73706926 -0.23643742 2.25405049
C  -3.930666 -1.225717 1.96156101
C  -3.89888739 -1.67021369 0.51405465
H  -1.80613799 -0.18838392 -0.15321885
H  -1.80562226 -0.78348469 2.0917185
H  -2.79433172 0.12481088 3.28201247
H  -3.80609118 -2.06694831 2.64780303
H  -4.87752091 -0.74332576 2.21997996
H  -3.00679061 -2.2839493 0.34080845
C  -3.62056287 -1.05844078 -1.89309386
H  -2.65126512 -1.56099958 -1.93649471
H  -4.39299994 -1.79300759 -2.13935542
H  -3.64841488 -0.28318271 -2.66053098
C  -5.26016827 0.21315882 -0.49840681
H  -5.2533284 1.07856804 -1.16555642
H  -6.02597024 -0.47640341 -0.86242374
H  -5.57616944 0.55161494 0.49119374
C  -3.53135932 2.09067874 1.69163028
H  -2.68429976 2.74548866 1.95963477
H  -4.08922717 2.60139516 0.90727563
H  -4.12652787 1.97893356 2.60032154
C  -2.4457205 1.65609985 -1.11005587
H  -3.23249074 1.66054549 -1.86762571
H  -2.51804238 2.62290363 -0.60587045
C  -1.07753633 1.5585217 -1.81146656
H  -1.01140497 0.60028221 -2.3369153
H  -1.04880849 2.33754699 -2.58293153
C  0.90804799 0.67120694 -0.6302251
H  0.66646018 -0.26855526 -1.13100084
C  0.1084404 1.72018558 -0.88917133
C  0.32995497 3.1109787 -0.36170629
H  -0.56180825 3.50970361 0.13569676
H  1.15486754 3.17210585 0.34714846
H  0.55009705 3.7975986 -1.18689005
C  2.15327733 0.62160851 0.20153862
H  2.06710308 -0.19192024 0.93354058
N  -6.63955053 -3.51792694 -0.58031709
H  -7.29299824 -3.62876138 0.18817759
H  -7.19803284 -3.29762607 -1.39846646
H  -6.23821777 -4.43481208 -0.74841258
H  -4.77057405 -2.30485044 0.29555026
H  2.28541081 1.54298142 0.77341038
C  3.40163952 0.35451661 -0.66380361
H  3.22966953 -0.53939204 -1.27215551
H  3.52182242 1.19195598 -1.36321945
C  4.67154701 0.18414541 0.13248217
C  5.13837932 1.39851837 0.88473953
H  6.1578802 1.3044415 1.257677
H  5.10650131 2.27957269 0.23515003
H  4.49157891 1.61244412 1.7430487
C  5.30883613 -0.9973465 0.11721377
H  4.89685433 -1.79794235 -0.49384864
C  6.56172437 -1.3458381 0.83686359
H  6.46491096 -2.29581547 1.36378761
H  6.88089875 -0.58504051 1.54572027
Cl 7.93757372 -1.57967248 -0.31974364
