program: Gaussian 09
title: 000075193
version: EM64L-G09RevD.01
frameworkgroup: C1[X(C10H13N)]
method: RPBEPBE
basis: SDD
operation: Freq
keyword: #pfreq=noraman
keyword: PBEPBE/SDD
title: #p freq=noraman PBEPBE/SDD
converged: YES YES NO NO
title: Mulliken charges:
elementType: N C C C C C C C C C C H H H H H H H H H H H H H
charge: -0.705912 -0.410685 -0.409100 -0.540100 -0.534723 0.317754 0.286928 -0.601176 -0.379969 0.508837 -0.453635 0.202238 0.203069 0.202148 0.202637 0.217296 0.214092 0.215477 0.210473 0.217874 0.223288 0.212653 0.300296 0.300241
chargesum: 0.00000
title: Mulliken charges with hydrogens summed into heavy atoms:
elementType: N C C C C C C C C C C
charge: -0.105375 -0.005378 -0.004315 -0.108712 -0.108773 0.317754 0.286928 -0.383302 -0.156681 0.508837 -0.240982
polarizability: 1.53952223e+02 -3.12725055e+00 1.17302505e+02 2.62914184e-01 -1.32908284e+00 6.42670358e+01
1716.lowfreq: -16.8928 -0.0008 -0.0006 0.0003 9.0759 11.7840 87.4552 124.5759 203.0005
frequency: 87.4272 124.5720 202.9982 258.8867 294.9536 306.2152 329.9670 355.6766 396.9993 420.9746 431.4785 444.0983 525.7177 567.0246 608.2776 703.2694 724.1213 725.7775 805.3773 825.6273 860.8343 863.9482 906.0545 920.3147 935.9215 943.8374 993.4071 1036.8599 1082.0784 1091.9529 1126.2397 1131.3624 1160.6228 1176.2636 1212.4980 1235.3464 1247.5254 1279.4775 1314.9334 1332.2680 1336.8493 1344.1568 1353.0633 1386.5949 1443.7955 1453.8721 1460.7766 1468.4656 1474.1646 1512.8748 1585.4086 1631.9495 1642.0193 2945.9235 2953.0228 2974.1094 2975.5185 3009.1697 3013.8290 3034.7959 3043.7403 3095.9599 3101.3285 3129.0553 3570.5423 3711.9499
redmass: 2.7292 2.7106 2.7824 3.4411 1.9292 1.2377 2.6600 1.0397 3.6935 3.1078 2.5437 3.2754 3.6381 2.6040 3.2013 2.5176 4.9217 3.4348 1.4306 1.5482 1.9216 1.9627 1.5393 2.4839 2.7175 1.3622 2.2377 1.4822 1.8395 1.6813 1.6443 1.1730 1.4806 1.5560 1.9736 1.4193 1.2869 1.2501 1.9934 1.5026 1.7237 1.4145 1.7852 5.4901 3.3614 1.1394 1.1038 1.0923 1.0982 3.0792 6.7765 1.9467 1.9964 1.0649 1.0639 1.0622 1.0638 1.0933 1.0948 1.0988 1.1044 1.0904 1.0865 1.0965 1.0446 1.1040
irintensity: 1.4949 0.7068 9.4034 2.4790 10.9903 284.5128 23.3867 0.7733 0.1534 1.7656 4.3192 2.0501 0.4858 2.0292 1.5768 2.7815 0.3287 3.8387 27.9635 22.6341 9.5056 12.1207 14.7461 2.8511 2.3159 1.4635 2.9116 1.2291 1.0316 0.1239 11.6198 3.7147 1.6077 5.1935 2.2486 6.1780 7.5250 3.5178 38.7197 1.9221 11.4688 1.2083 9.5347 12.4545 5.2171 1.2941 12.2623 11.3222 10.0048 104.4501 12.8466 1.8304 295.8990 44.7069 29.8277 31.6742 36.9232 61.8874 21.8284 78.5994 77.0167 29.7398 17.6984 31.9902 57.3622 17.8167
temp: 298.150 k
press: 1.00000 atm
elementType: 7 6 6 6 6 6 6 6 6 6 6 1 1 1 1 1 1 1 1 1 1 1 1 1
symmnumber: 1
zpe: 542172.2 jmol-1
zpe.correction: 0.206503 hartree
zpe.thermalcorrener: 0.216228 hartree
zpe.thermalcorrenthalpy: 0.217172 hartree
zpe.thermalcorrgfe: 0.172170 hartree
zpe.sumelectzpe: -442.815437 hartree
zpe.sumelectthermal: -442.805712 hartree
zpe.sumelectthermalent: -442.804767 hartree
zpe.sumelectthermalfe: -442.849769 hartree
dipole: 1.3025 -0.7917 0.0381
dipole: 1.5248
quadrupole: -51.8694 -60.1710 -70.6991
quadrupole: -2.1787 0.1197 -0.4497
quadrupole: 9.0437 0.7422 -9.7859 -2.1787 0.1197 -0.4497
hfenergy: -443.0219391 hartree
pointgroup: C01 [X(C10H13N1)]
dipole: 0.5076779 -0.319149 0.0164576 debye
dipolederiv: -1.4270821 0.4427251 -0.0176542 0.5248902 -0.2647858 -0.0154013 -0.0167231 -0.0164325 -0.7628347 0.1085883 0.0376586 -0.0191582 0.0092718 0.0235866 -0.0306076 0.02762 -0.0236428 0.1373049 0.1082233 -0.0084954 0.0278553 0.0237698 0.0171721 -0.0209591 -0.0232276 -0.0276656 0.1385826 0.0333701 -0.0051262 -0.0104791 -0.0476831 0.0585517 0.0128051 0.0531105 0.0447154 0.1597325 0.0924026 -0.0338437 0.01856 -0.0059565 0.080206 0.0111559 -0.0393689 0.0309691 0.1820817 0.2085934 -0.0476715 -0.0240192 0.202532 0.2792391 -0.0128161 -0.118182 -0.0409084 -0.0324445 -0.0560083 -0.1557242 0.0252263 -0.2706596 -0.2850662 0.0135735 0.1372226 -0.0093197 -0.1027337 -0.5121199 0.1811145 -0.0051627 -0.2455027 0.06941 -0.0217782 0.0144782 -0.0116931 -0.255764 0.2210219 0.1629469 -0.0027769 -0.0176905 0.153054 -0.0197667 -0.006084 -0.0179295 -0.1339997 1.4572458 -0.496935 0.0152337 -0.6038856 0.182909 -0.0003618 0.0243025 0.0037429 0.1451886 -0.2853072 -0.0130752 0.0060648 0.4946962 -0.0920948 0.0013144 -0.0199712 0.0008876 -0.2528601 0.065207 0.0245388 0.0140514 0.0564365 0.0467433 0.0509718 -0.0430155 0.0032131 -0.1868885 -0.1462946 -0.1406059 0.0171099 -0.1562741 -0.0715767 0.0154231 0.0514535 0.0349211 0.0708142 0.0901769 -0.0120977 -0.03202 -0.0405166 0.0269445 0.0459232 0.0371729 0.014607 -0.1888197 -0.2313226 0.0966958 -0.0187442 0.1046568 0.0081402 0.0079583 -0.059155 0.0165805 0.0715251 -0.0069106 0.0643246 0.0388265 0.0182675 -0.1179147 -0.0934028 -0.0033672 -0.1339097 0.022163 -0.0260158 -0.0581543 0.0164126 -0.0456685 0.0221172 0.0616509 0.0266749 0.1171461 -0.1275205 -0.003311 -0.0159881 -0.0082589 0.0368137 -0.1372645 -0.1012484 0.0445438 -0.1279467 0.018489 -0.0836919 0.057035 -0.0420531 0.0396204 0.0471005 0.0550199 -0.088601 0.1136802 -0.1365261 0.0511863 0.0369097 -0.0025872 0.0581014 -0.1446421 0.0094822 -0.0053977 0.0048177 0.1570526 0.0792281 0.0569614 -0.0011363 0.026121 -0.1405004 0.0093265 0.00324 0.0049351 0.1358329 -0.1116512 -0.1147802 0.0031195 -0.0981821 0.0037894 0.0037725 0.0022904 0.0021845 0.1695696 0.1797664 -0.0367389 0.0010556 -0.0471259 0.1224805 0.0087692 0.0012046 0.0086107 0.3849669 0.194705 -0.0216743 0.0005343 -0.0160318 0.112401 0.0091955 -0.0002206 0.0084371 0.387088 unknown
polarizability: 153.8489624|-3.6779257|117.3949949|0.3114224|-1.5287976|64.2778069 unknown
InChI: InChI=1S/C10H13N/c11-10-6-5-8-3-1-2-4-9(8)7-10/h5-7H,1-4,11H2
charge 0 multiplicity 1
24 atoms
N  3.5395 -0.765472 0.030524
C  -2.727576 -0.980312 -0.344173
C  -2.936251 0.378955 0.358718
C  -1.379478 -1.602672 0.083566
C  -1.846859 1.380386 -0.084726
C  -0.213479 -0.615357 0.018597
C  -0.438685 0.789576 -0.029269
C  1.109691 -1.116078 0.036304
C  0.690969 1.64598 -0.052427
C  2.237255 -0.252221 0.012346
C  2.008373 1.153324 -0.031894
H  -2.738908 -0.825632 -1.442097
H  -3.554233 -1.676147 -0.103786
H  -2.887502 0.230555 1.456577
H  -3.939148 0.786885 0.128235
H  -1.15099 -2.490727 -0.537854
H  -1.474468 -1.974009 1.126211
H  -1.892762 2.295912 0.5375
H  -2.067898 1.70496 -1.124306
H  1.267909 -2.203313 0.070149
H  0.531718 2.732079 -0.086175
H  2.859091 1.84618 -0.048444
H  3.704013 -1.766552 0.065303
H  4.342018 -0.144203 0.010322
