program: Gaussian 16
title: 1a_optimization_1
version: ES64L-G16RevC.02
method: UwB97XD
basis: def2SVP
operation: Freq
keyword: #P
keyword: Geom=AllCheck
keyword: Guess=TCheck
keyword: SCRF=Check
keyword: GenChk
keyword: UwB97XD/def2SVPFreq
converged: YES YES NO YES
polarizability: 4.84594613e+02 5.64190952e+01 4.16098293e+02 8.72741538e+00 -6.78702536e+01 4.05067635e+02
1716.lowfreq: -5.1543 -1.2787 -0.0006 0.0006 0.0009 5.9190 12.8852 23.8466 28.5311
frequency: 12.4612 23.8204 28.4966 35.2866 42.6152 51.1376 59.4082 69.0949 92.5649 100.2820 125.7171 174.2254 196.2809 222.6323 235.9501 250.2843 264.3240 309.8837 319.0184 364.9655 404.5615 413.0401 416.8161 421.5465 434.7742 440.4637 455.1733 490.4860 500.6975 512.4074 554.4745 608.3322 630.3260 630.9390 631.7141 633.1230 634.3512 696.2744 715.1822 719.3366 723.8652 726.2352 728.5096 732.2092 775.9929 778.9553 782.6829 794.1959 861.9852 872.4083 880.7410 883.1273 888.0664 935.3266 944.0495 958.6524 964.8238 970.7149 1001.1173 1009.3484 1014.9314 1015.5782 1017.1091 1024.2097 1025.6431 1030.2612 1031.6901 1038.0965 1049.6013 1051.8933 1057.3487 1057.7821 1058.4686 1060.7598 1104.8457 1108.8458 1110.7381 1118.0229 1126.5654 1139.9682 1163.1891 1164.1642 1167.5237 1169.8469 1180.8406 1188.2490 1192.7028 1196.8358 1203.1592 1311.1361 1321.2502 1325.2590 1328.6691 1332.9660 1362.4606 1362.9789 1364.2222 1365.2515 1399.0252 1474.9652 1477.3741 1478.5461 1493.8430 1516.2034 1521.9366 1522.8499 1528.8884 1634.4668 1644.6472 1655.2637 1660.3395 1662.6482 1672.9177 1675.9243 1679.3768 3198.9081 3200.1833 3201.2346 3201.6439 3206.9445 3207.3462 3208.4500 3208.9313 3213.9208 3217.7286 3220.2521 3221.3416 3221.9684 3225.1759 3226.0841 3228.6014 3229.9024 3230.7704 3232.0628 3233.9741
redmass: 5.6053 4.8457 4.5685 4.9364 4.0816 3.8469 4.8677 4.6024 4.6025 5.3364 4.9832 5.2783 4.6525 4.9892 4.9248 5.1846 4.9858 5.5865 6.8330 7.1488 7.3820 2.8547 2.8449 2.9168 3.0622 5.6662 6.4085 4.2397 3.7414 4.2486 4.8071 4.5527 6.4173 6.3633 6.1586 6.3636 7.1320 6.5137 1.6294 5.5420 1.7277 1.7476 1.6680 6.2499 1.7814 1.8814 1.9137 2.1511 1.2726 3.2428 1.5327 1.2649 1.2577 2.3869 2.1421 1.4823 1.3641 1.3706 4.8991 5.1523 1.4511 5.0728 6.0777 1.3706 1.3906 1.3819 1.3352 1.3328 1.3582 1.3586 2.4569 2.3905 2.0611 2.0673 1.4888 1.5147 1.4817 1.4864 2.8409 3.1214 1.0852 1.0861 1.0840 1.0847 2.2803 1.3252 1.1293 1.1141 1.2275 2.1878 1.8426 1.7404 1.5549 3.1729 3.1321 3.5739 3.2090 3.3103 5.0942 2.3360 2.5158 2.3753 2.7322 2.2803 2.2469 2.2745 2.4327 5.5783 5.9173 5.8059 6.0895 6.2059 6.0507 6.1278 6.1482 1.0905 1.0869 1.0896 1.0868 1.0915 1.0889 1.0912 1.0889 1.0928 1.0931 1.0945 1.0958 1.0971 1.0967 1.0964 1.0987 1.1014 1.1012 1.0955 1.0960
irintensity: 0.1205 0.3579 0.8962 0.4371 0.1740 0.8300 0.6343 0.1618 0.7382 1.4927 1.3306 1.0228 1.5492 0.6561 1.0887 0.9464 1.2241 1.7518 8.4841 17.8317 27.3515 1.7771 0.1667 1.8528 0.8963 15.2537 17.6176 15.7815 37.5109 74.0042 13.4291 51.2873 1.2643 1.6558 3.7777 2.2014 31.4965 8.1987 77.7196 28.4882 76.1287 49.7788 29.4934 22.0452 55.7184 50.5357 7.1269 50.9716 0.5240 14.4013 4.0073 0.3649 0.4184 5.6134 3.5619 6.1390 1.5786 1.7088 17.0703 0.9281 0.5985 4.0198 4.0095 0.1380 0.1185 0.0196 0.4239 1.0271 0.0395 0.2589 4.3444 8.7133 22.2879 13.4904 17.1192 5.6664 7.9067 18.8189 25.8219 53.6014 0.2346 0.8456 0.3390 0.2430 29.4814 24.6482 2.7174 1.8876 9.7111 45.2542 11.4248 33.9109 5.4199 49.3852 1.9716 3.9084 1.0744 0.6162 304.6185 32.8163 2.0042 24.9359 107.5699 201.5182 6.8790 13.1629 6.8919 3.9552 7.0967 100.6213 6.3327 0.4954 12.0894 0.8313 0.2004 0.7931 7.1607 0.6031 4.3275 8.3057 0.1503 9.4558 0.2941 1.1786 6.8580 29.6824 15.9774 12.3515 4.8766 8.7746 7.1916 15.2365 16.4005 10.9614 6.7893
temp: 298.150 k
press: 1.00000 atm
elementType: 6 6 6 6 1 6 1 6 1 1 1 6 6 6 6 1 6 1 6 1 1 1 15 7 6 6 6 6 6 1 6 1 6 1 1 1 6 6 6 6 1 6 1 6 1 1 1
symmnumber: 1
zpe: 993577.5 jmol-1
zpe.correction: 0.378434 hartree
zpe.thermalcorrener: 0.400862 hartree
zpe.thermalcorrenthalpy: 0.401807 hartree
zpe.thermalcorrgfe: 0.321755 hartree
zpe.sumelectzpe: -1359.219760 hartree
zpe.sumelectthermal: -1359.197331 hartree
zpe.sumelectthermalent: -1359.196387 hartree
zpe.sumelectthermalfe: -1359.276439 hartree
dipole: 3.3503 -1.0697 -2.5623
dipole: 4.3513
quadrupole: -141.6566 -153.3626 -154.5194
quadrupole: 10.9792 0.9703 -1.0400
quadrupole: 8.1896 -3.5164 -4.6732 10.9792 0.9703 -1.0400
hfenergy: -1359.5981937 hartree
pointgroup: C01 [X(C25H20N1P1)]
dipole: 1.3181007 -0.4208494 -1.0081027 debye
polarizability: 484.5946127|56.4190952|416.0982931|8.7274154|-67.8702536|405.0676353 unknown
InChI: InChI=1/25C.N.P.20H
charge 0 multiplicity 3
47 atoms
C  2.73260724 0.64267909 0.76193505
C  4.01111359 0.09508325 0.5846074
C  2.5927473 2.00574391 1.04964658
C  5.13697619 0.91096507 0.67082886
H  4.12817623 -0.97164306 0.37196022
C  3.7245121 2.81478816 1.14483874
H  1.59575031 2.42683319 1.19523061
C  4.99474709 2.27107464 0.95234482
H  6.13057765 0.48147302 0.52448787
H  3.61108174 3.87858074 1.36602885
H  5.8787855 2.90900535 1.02362363
C  1.16447916 -1.04922861 -1.06493693
C  0.27854068 -2.10549182 -1.3172139
C  1.84736975 -0.44534601 -2.12844747
C  0.06361375 -2.54007071 -2.6241938
H  -0.25091041 -2.58721322 -0.49022542
C  1.63742303 -0.89239424 -3.43197887
H  2.53793064 0.38102903 -1.94358831
C  0.74371519 -1.93501819 -3.68137876
H  -0.63391083 -3.35854777 -2.81556174
H  2.17050257 -0.41752092 -4.2587926
H  0.57867931 -2.27887538 -4.70512914
P  1.29320655 -0.4582774 0.66210731
N  -0.00101112 0.44942803 1.0533098
C  -1.31543101 0.16952378 0.7341109
C  -1.98813438 -0.90401651 1.46729387
C  -3.02285778 -1.67669554 0.89436155
C  -1.5498985 -1.25448693 2.7636919
C  -3.60275268 -2.72893188 1.5964383
H  -3.34946788 -1.47420117 -0.12707078
C  -2.13692567 -2.30483844 3.46151236
H  -0.74570818 -0.67757031 3.22493959
C  -3.1703702 -3.04742563 2.88596644
H  -4.39395598 -3.31663805 1.12420018
H  -1.78563693 -2.54497998 4.46817271
H  -3.62942473 -3.87348427 3.43391407
C  -1.94190037 1.00388864 -0.27793962
C  -3.34566161 1.16658681 -0.37610613
C  -1.13905454 1.74294614 -1.18165959
C  -3.90707349 1.98751885 -1.34727496
H  -4.00234475 0.66595765 0.33680124
C  -1.70892482 2.55939147 -2.15123527
H  -0.05258712 1.6596914 -1.12299193
C  -3.09725323 2.68431112 -2.24893347
H  -4.9937545 2.09519984 -1.39343528
H  -1.06057919 3.10522181 -2.84135185
H  -3.54361768 3.32665603 -3.01145602
