program: Gaussian 16
title: 1a_optimization_1
version: ES64L-G16RevC.02
method: UwB97XD
basis: def2SVP
operation: Freq
keyword: #P
keyword: Geom=AllCheck
keyword: Guess=TCheck
keyword: SCRF=Check
keyword: GenChk
keyword: UwB97XD/def2SVP
keyword: Freq
converged: YES YES YES YES
polarizability: 4.33208076e+02 5.58646388e+01 4.70238535e+02 2.35798340e+01 -8.48323454e+01 4.31562839e+02
1716.lowfreq: -8.8614 -6.7667 -0.0022 -0.0020 -0.0018 6.3375 14.8448 31.2553 33.4090
frequency: 12.3130 30.8561 33.2048 35.8834 49.3842 63.4150 67.6171 71.5478 84.6919 95.5963 123.6961 130.2560 149.3646 180.6791 225.4033 229.8903 232.5806 257.0698 272.9606 305.2753 317.8285 356.9506 412.4133 417.3530 419.1911 423.0709 432.9792 451.1323 461.7811 494.1160 507.3674 518.7053 547.2854 603.7013 620.4705 628.9492 630.1341 632.0011 633.3570 645.9260 684.7879 712.6930 722.6272 722.9646 726.2240 733.7990 741.0515 771.8181 778.9355 783.6203 790.0303 806.1578 860.2508 876.1311 882.4267 884.1638 930.2253 937.1129 961.6049 971.2272 974.9725 1000.8474 1013.6475 1014.4122 1017.2019 1017.9381 1021.9209 1027.5389 1028.3963 1032.1330 1040.1184 1052.0111 1052.1264 1057.1309 1057.8576 1058.8899 1059.6121 1106.0187 1107.9064 1109.5698 1122.8593 1135.5754 1148.0380 1163.8599 1165.7150 1166.3781 1168.8041 1170.7934 1188.9572 1192.0411 1195.1748 1205.9403 1304.2297 1314.9529 1321.5865 1328.7243 1337.3664 1358.7693 1364.4873 1366.2879 1367.8153 1368.5920 1476.1993 1477.6941 1480.1051 1491.3234 1520.4298 1521.6042 1525.2506 1528.5051 1630.9910 1651.9615 1653.7458 1662.6314 1665.5386 1676.3933 1679.5650 1681.1679 3202.3250 3202.7866 3203.6243 3208.3227 3209.6169 3210.6996 3211.7750 3213.4849 3219.2570 3220.1247 3221.1949 3224.1409 3226.0649 3226.7199 3228.8049 3230.4414 3232.9372 3233.8129 3237.5420 3239.4727
redmass: 5.6053 4.2863 4.8413 4.5368 5.1522 4.8550 4.2243 4.6490 4.6326 6.0047 5.3511 11.1103 7.0294 5.4275 4.7110 4.9549 5.4215 4.9357 5.4169 5.6299 6.9526 6.4616 2.8171 3.0661 3.9666 3.7253 3.0168 6.2503 6.1377 4.3242 3.8505 4.4954 4.9853 4.7445 8.1131 6.5578 6.4255 6.3833 6.3607 11.1173 7.9421 1.5912 1.7531 1.7639 1.7061 5.0994 6.6130 2.4350 1.7261 1.9408 2.2645 3.8457 1.2529 1.2515 1.2494 1.2450 4.0228 1.5654 1.4419 1.3690 1.3576 5.0960 3.0893 1.8001 5.3273 5.4517 1.3723 1.3868 1.3864 1.3326 1.3391 1.3645 1.3625 2.2928 2.3068 2.1449 2.0612 1.4890 1.4820 1.4765 1.5318 3.0503 3.1323 2.5664 1.2212 1.1122 1.0858 1.0863 1.1255 1.1298 1.1268 1.1734 3.0262 2.0225 1.4954 1.4827 3.9207 2.2216 3.2032 3.9181 3.1192 5.4667 2.3544 2.5045 2.3797 2.6507 2.2367 2.2863 2.2783 2.4144 5.3673 6.0353 5.7535 6.1215 6.2310 6.1562 6.2103 6.1338 1.0907 1.0872 1.0869 1.0879 1.0917 1.0910 1.0893 1.0906 1.0932 1.0944 1.0932 1.0969 1.0974 1.0975 1.0971 1.1002 1.1014 1.1007 1.0930 1.0951
irintensity: 0.3781 0.2681 0.0996 1.3587 1.1872 1.5535 0.0781 0.2606 0.2642 0.8370 0.8365 15.9221 8.9089 0.1887 0.0730 0.7839 5.6541 1.2474 0.7218 0.6390 1.8057 14.4031 0.0590 3.3936 6.0238 6.5906 0.7483 10.2191 30.7317 14.3420 25.1414 124.0973 15.5984 48.7593 9.2403 14.4088 0.3723 0.8405 0.8157 101.4319 13.3799 101.9416 83.7651 6.4755 50.3680 69.2892 61.5783 73.8449 38.4916 1.0543 43.5029 49.8868 0.1589 0.8772 0.2561 0.1465 7.4119 5.1640 5.6583 0.2411 0.4328 4.6634 0.3957 0.3232 3.6993 0.9953 0.5721 0.1384 0.1260 0.4088 0.5223 0.2600 0.1972 3.2287 6.8653 8.3190 21.9870 25.5280 11.5459 5.1958 21.6580 75.9232 126.6122 24.0806 7.2904 2.8282 0.5856 0.4117 2.2934 2.2037 1.6137 3.3136 39.3810 7.8443 9.4127 2.5224 11.7645 25.1645 26.4040 18.5894 3.3908 24.2115 41.2636 6.0616 27.1548 54.7737 112.7583 4.7246 6.6427 7.1376 2.1992 3.6407 50.4717 1.9516 1.2462 5.8881 7.6293 5.8601 0.4126 7.0922 1.2055 1.0292 8.0872 8.3365 0.5917 0.7343 0.9768 20.1892 5.2069 22.2796 8.4407 7.2523 4.6136 6.4386 10.9665 10.0329 8.6049 3.3917
temp: 298.150 k
press: 1.00000 atm
elementType: 6 6 6 6 1 6 1 6 1 1 1 6 6 6 6 1 6 1 6 1 1 1 7 6 6 6 6 6 1 6 1 6 1 1 1 6 6 6 6 1 6 1 6 1 1 1 15 16
symmnumber: 1
zpe: 999585.8 jmol-1
zpe.correction: 0.380722 hartree
zpe.thermalcorrener: 0.404479 hartree
zpe.thermalcorrenthalpy: 0.405423 hartree
zpe.thermalcorrgfe: 0.323307 hartree
zpe.sumelectzpe: -1757.304334 hartree
zpe.sumelectthermal: -1757.280577 hartree
zpe.sumelectthermalent: -1757.279633 hartree
zpe.sumelectthermalfe: -1757.361749 hartree
dipole: 1.1839 1.7055 -5.4559
dipole: 5.8376
quadrupole: -157.6547 -163.0092 -172.1649
quadrupole: 18.7841 -5.7840 5.4564
quadrupole: 6.6216 1.2670 -7.8886 18.7841 -5.7840 5.4564
hfenergy: -1757.685056 hartree
pointgroup: C01[X(C25H20N1P1S1)]
dipole: 0.4657834 0.6710061 -2.1465119 debye
polarizability: 433.208076|55.8646388|470.2385355|23.579834|-84.8323454|431.5628394 unknown
InChI: InChI=1/25C.N.P.S.20H
charge 0 multiplicity 3
48 atoms
C  2.68529398 0.7863161 0.80357308
C  3.93095709 0.40214988 0.2889656
C  2.48750153 2.09149014 1.26610328
C  4.96792112 1.3285691 0.22434953
H  4.09131715 -0.62011665 -0.06488337
C  3.53127325 3.01410544 1.19720173
H  1.51916658 2.38463787 1.67681467
C  4.76778614 2.63467442 0.67674336
H  5.93728093 1.02996721 -0.18042813
H  3.37548669 4.03411843 1.55506766
H  5.58323833 3.35978808 0.62427933
C  1.13748042 -1.16459863 -0.7334985
C  0.58439701 -2.44519951 -0.85187185
C  1.39486857 -0.40541878 -1.88269694
C  0.28612298 -2.95992685 -2.11167589
H  0.39046061 -3.0372191 0.04581958
C  1.09867469 -0.92736886 -3.14000716
H  1.82551651 0.59501055 -1.80215233
C  0.54210532 -2.20162518 -3.25459323
H  -0.14635865 -3.95885079 -2.19986745
H  1.30246825 -0.33399387 -4.03381451
H  0.30902783 -2.60739106 -4.24178202
N  -0.00684763 0.43898121 1.33703991
C  -1.25872163 0.17414963 0.80165934
C  -2.02760429 -0.92420493 1.40875369
C  -2.78026431 -1.81174369 0.61577155
C  -1.97720521 -1.14480528 2.79831808
C  -3.47712387 -2.86666092 1.19936048
H  -2.79359543 -1.69103412 -0.46914292
C  -2.67825405 -2.19853104 3.3754965
H  -1.38151081 -0.47787167 3.42425021
C  -3.43430596 -3.062522 2.58064667
H  -4.04895925 -3.54925995 0.56616518
H  -2.63349979 -2.34757608 4.45693875
H  -3.98139886 -3.89133091 3.03585313
C  -1.72835729 1.03705881 -0.2564904
C  -3.0822397 1.04932902 -0.67940037
C  -0.8428787 1.95322193 -0.88130074
C  -3.50491381 1.89583387 -1.69595377
H  -3.81152155 0.40260644 -0.19043884
C  -1.27747457 2.79596236 -1.89599797
H  0.20090276 1.99907989 -0.56565228
C  -2.60879719 2.76967072 -2.32020504
H  -4.55442841 1.88157701 -2.00008714
H  -0.56764863 3.48416464 -2.36142888
H  -2.94832172 3.43174394 -3.11976157
P  1.37702047 -0.4584292 0.92338362
S  1.61330308 -1.78474763 2.35590633
