program: Gaussian 09
title: 000075326
version: EM64L-G09RevD.01
frameworkgroup: C1[X(C8H18N2O10P2)]
method: RPBEPBE
basis: SDD
operation: Freq
keyword: #p
keyword: freq=noraman
keyword: PBEPBE/SDD
title: #p freq=noraman PBEPBE/SDD
converged: YES YES NO NO
title: Mulliken charges:
elementType: P P O O O O O O O O O O N N C C C C C C C C H H H H H H H H H H H H H H H H H H
charge: 1.246674 1.246403 -0.685799 -0.687172 -0.684991 -0.686736 -0.636518 -0.637578 -0.392308 -0.392342 -0.297862 -0.298868 -0.069036 -0.069878 -0.388962 -0.390634 -0.704334 -0.704724 -0.462208 -0.464750 0.266734 0.268614 0.225136 0.265876 0.267305 0.225389 0.283637 0.283480 0.283049 0.284241 0.285777 0.264324 0.288240 0.264460 0.394271 0.417852 0.394422 0.418148 0.390417 0.390254
chargesum: 0.00000
title: Mulliken charges with hydrogens summed into heavy atoms:
elementType: P P O O O O O O O O O O N N C C C C C C C C
charge: 1.246674 1.246403 -0.291528 -0.269321 -0.290570 -0.268588 -0.636518 -0.637578 -0.001891 -0.002088 -0.297862 -0.298868 -0.069036 -0.069878 0.102050 0.102061 -0.137217 -0.137434 0.087892 0.087950 0.266734 0.268614
polarizability: 1.93970971e+02 1.87904663e-01 1.93724155e+02 -1.27699772e+00 -4.70412178e-02 1.50787944e+02
1716.lowfreq: -13.2631 -12.5690 -7.1803 -2.7740 -0.0009 0.0013 0.0016 17.4320 25.2839
frequency: -11.1206 16.7681 24.4819 27.8261 29.7687 54.0553 55.2530 62.2537 69.5554 101.5770 105.5612 128.3809 129.4240 132.3115 134.1507 186.2022 189.5398 196.4707 203.9098 206.3737 206.8136 242.2142 270.7315 293.0863 295.7001 319.6457 320.9734 341.5589 342.4851 355.5446 357.2177 369.6499 391.9592 430.8543 449.5447 462.8059 473.2508 488.1819 509.4162 595.9649 598.0850 615.0077 620.1094 638.1733 643.1329 646.6132 651.5864 699.8367 705.1893 747.7447 751.0680 767.6284 808.5289 811.2836 854.5122 883.1704 894.7720 899.6371 963.5017 964.5596 994.0712 995.0408 1011.8513 1032.8875 1040.9299 1047.9191 1060.2493 1066.7285 1151.4747 1155.8792 1158.6371 1172.7655 1175.8007 1208.8348 1221.2484 1270.4618 1274.2830 1278.1062 1300.9746 1302.2108 1322.9732 1348.8944 1356.0658 1359.1150 1364.8344 1373.1229 1373.3091 1388.1578 1411.4001 1411.7979 1417.0137 1418.3452 1460.7333 1476.8721 1641.9722 1644.1811 2968.7568 2969.2995 2977.4464 2979.1088 2979.8953 2986.4756 3029.5586 3030.7368 3034.8690 3061.2406 3104.3149 3104.9937 3324.1647 3335.0134 3510.5513 3510.8154 3593.6214 3593.7648
redmass: 7.0854 7.9681 6.9058 7.2044 7.4547 5.7952 4.4090 7.8748 2.9411 9.5949 8.5817 5.8918 5.9830 6.0479 7.3610 4.7868 2.4024 4.2590 5.6849 3.7224 1.6754 2.4388 4.1249 2.8987 3.7165 6.5667 6.6533 3.8818 3.7682 3.1254 4.1471 2.6088 6.6701 3.0711 1.8392 2.9095 2.6061 3.0509 3.2228 4.5377 4.9084 5.5823 5.0477 1.2661 1.3239 1.2631 1.2172 6.0551 4.7291 5.7120 11.1057 1.3655 4.6961 4.4206 3.6896 2.9619 1.9609 2.2461 2.5154 2.6980 1.6983 1.6081 3.4163 2.6773 3.2398 2.5678 2.5091 2.1189 1.4565 1.4613 1.6827 1.4380 1.3623 1.4106 1.0966 1.5217 1.6547 1.5433 1.1616 1.1950 1.3377 1.9340 1.5925 1.5978 1.4900 1.7707 1.7258 1.2265 1.1025 1.1065 1.1551 1.1601 1.0971 1.0875 7.9386 7.9306 1.0597 1.0597 1.0603 1.0652 1.0658 1.0606 1.1006 1.1005 1.1022 1.1064 1.0982 1.0980 1.0658 1.0658 1.0643 1.0643 1.0662 1.0662
irintensity: 2.4253 1.0822 2.2544 1.6932 1.8773 1.3154 0.0921 2.3624 3.6286 0.9470 0.5878 1.1433 1.9410 4.8119 8.3017 16.5117 71.2649 6.1388 10.8705 18.4750 0.4731 69.7780 8.5417 1.4786 7.9317 6.2061 20.3699 49.6800 151.8802 0.7824 8.9059 50.0036 25.2146 33.5331 3.8306 25.0945 20.9370 44.2456 8.6901 11.0241 19.1890 84.7003 2.9452 88.3800 79.3872 381.3368 104.2207 105.4659 260.4107 122.8284 152.2677 31.9653 18.6322 7.8020 5.2464 0.4595 11.2526 16.6545 78.9231 3.3001 8.8397 32.4343 37.2081 271.0740 56.1554 153.1001 489.6142 43.0399 9.5273 140.1273 20.0329 104.1442 122.0421 14.5386 0.0355 13.0907 32.8736 6.2702 18.2605 8.7196 8.1767 0.2082 56.0142 35.7469 20.5211 44.6078 40.3999 0.9338 37.7288 27.1156 48.4439 1.1357 0.1283 36.6366 178.2152 265.0353 17.3777 32.3674 5.1918 33.0964 15.2422 41.1082 3.0612 1.8250 4.5576 22.6141 3.1798 2.1718 262.4301 290.8137 34.5297 40.2121 39.5490 45.2657
temp: 298.150 k
press: 1.00000 atm
elementType: 15 15 8 8 8 8 8 8 8 8 8 8 7 7 6 6 6 6 6 6 6 6 1 1 1 1 1 1 1 1 1 1 1 1 1 1 1 1 1 1
symmnumber: 1
zpe: 762735.2 jmol-1
zpe.correction: 0.290511 hartree
zpe.thermalcorrener: 0.316602 hartree
zpe.thermalcorrenthalpy: 0.317547 hartree
zpe.thermalcorrgfe: 0.231709 hartree
zpe.sumelectzpe: -1858.068946 hartree
zpe.sumelectthermal: -1858.042854 hartree
zpe.sumelectthermalent: -1858.041910 hartree
zpe.sumelectthermalfe: -1858.127748 hartree
dipole: -0.0015 4.1221 0.0311
dipole: 4.1222
quadrupole: -176.2856 -124.8304 -145.4237
quadrupole: 0.2178 0.1492 0.0525
quadrupole: -27.4391 24.0162 3.4229 0.2178 0.1492 0.0525
hfenergy: -1858.3594567 hartree
pointgroup: C01 [X(C8H18N2O10P2)]
dipole: -0.0043136 1.6160204 0.136596 debye
polarizability: 193.8991166|0.352828|193.4815593|-2.1444849|3.2221911|151.1023934 unknown
InChI: InChI=1S/C8H18N2O10P2/c11-7(12)3-9(5-21(15,16)17)1-2-10(4-8(13)14)6-22(18,19)20/h11,13,15-16,18-19H,1-6H2
charge 0 multiplicity 1
40 atoms
P  3.600583 -1.652541 -0.386278
P  -3.607169 -1.701208 0.128385
O  3.649913 -3.354198 -0.684113
O  2.824072 -1.089529 -1.828293
O  -3.677689 -3.426785 0.175877
O  -2.841356 -1.357865 1.642539
O  4.984177 -0.923973 -0.053094
O  -4.978535 -0.914282 -0.111993
O  3.468877 2.922248 0.77128
O  -3.461464 2.998012 -0.323155
O  2.779948 1.540238 -0.9454
O  -2.796194 1.365689 1.168167
N  1.606882 -0.281996 1.057193
N  -1.611427 -0.134185 -1.079828
C  0.165765 -0.210228 0.752581
C  -0.170853 -0.095134 -0.768362
C  2.294201 -1.550706 1.010969
C  -2.286293 -1.403369 -1.223677
C  2.336305 0.906881 1.44547
C  -2.352989 1.091645 -1.290314
C  2.864194 1.774669 0.284928
C  -2.872219 1.783212 -0.013511
H  -0.2599 0.65762 1.29146
H  -0.342225 -1.105069 1.161741
H  0.345614 -0.911642 -1.3095
H  0.245284 0.849357 -1.167747
H  2.867876 -1.766987 1.933736
H  1.580342 -2.370328 0.834601
H  -1.565452 -2.232728 -1.153398
H  -2.845274 -1.493501 -2.175957
H  3.22496 0.638981 2.051631
H  1.714508 1.56957 2.080387
H  -3.249184 0.901263 -1.914222
H  -1.745492 1.842095 -1.835016
H  4.359257 -3.654144 -1.307096
H  2.773071 -0.084967 -1.824315
H  -4.394805 -3.805267 0.744875
H  -2.791231 -0.362634 1.783717
H  3.859561 3.45304 0.024615
H  -3.850437 3.414444 0.493619
