program: Gaussian 16
title: 1a_optimization_1
version: ES64L-G16RevC.02
method: UwB97XD
basis: def2SVP
operation: Freq
keyword: #P
keyword: Geom=AllCheck
keyword: Guess=TCheck
keyword: SCRF=Check
keyword: GenChk
keyword: UwB97XD/def2SVP
keyword: Freq
converged: YES YES YES YES
polarizability: 4.13419530e+02 2.61056454e+01 5.19266207e+02 -6.19358944e+01 7.48321158e+00 3.09372486e+02
1716.lowfreq: -9.8688 -0.0011 0.0007 0.0011 5.2646 7.9762 20.7939 28.3100 34.5743
frequency: 20.0202 28.2842 34.3906 42.1798 49.8900 56.1924 57.0377 69.4698 72.8009 100.3935 110.9908 168.7527 177.5624 190.9351 221.2347 234.8197 246.8416 255.5009 300.7035 303.6039 375.6621 387.9667 405.4279 413.3971 415.8843 416.7078 428.9593 461.2857 469.6901 495.5367 525.2638 536.6912 553.3041 601.9818 626.2631 629.8457 630.7767 631.4091 633.2404 696.1675 704.6080 715.5392 722.1909 723.7008 724.3163 744.1765 768.7312 778.9351 785.4291 787.9880 808.6521 849.4731 873.9186 883.7252 885.0263 926.4476 932.3001 957.8956 972.5109 974.4081 1001.1006 1011.0134 1012.3294 1017.7465 1018.1095 1021.2251 1027.9025 1029.8624 1030.9269 1039.1231 1052.3847 1052.8603 1055.9866 1057.3551 1057.9319 1058.8769 1106.0032 1108.5227 1108.9614 1114.4759 1131.2483 1151.9171 1163.3889 1164.3753 1165.4071 1168.8278 1169.1013 1186.3228 1191.9777 1194.2045 1197.7945 1257.5583 1299.1150 1316.4242 1325.1507 1328.3346 1336.8716 1360.9000 1361.4205 1366.8554 1369.2967 1369.7872 1477.0220 1478.0574 1479.6608 1492.2841 1515.8123 1523.1953 1524.7852 1526.0688 1631.9255 1649.4263 1653.8455 1663.2509 1665.0949 1673.6183 1678.0554 1681.8422 3202.3986 3203.6315 3207.8823 3208.5189 3209.0944 3210.6126 3214.9031 3215.9362 3219.4351 3219.9169 3220.5716 3221.9642 3225.3431 3226.8898 3226.9264 3228.8100 3229.8319 3232.4019 3232.8363 3233.6241
redmass: 5.6374 4.7348 4.0724 4.7389 5.0804 4.7292 4.0245 4.8662 4.9308 4.8081 5.0114 6.3533 5.6367 5.5077 4.6763 5.5502 5.0342 5.1558 5.7825 7.1215 7.0997 6.5643 5.7064 2.8789 2.8267 2.8509 2.9724 5.2918 4.8063 4.2080 4.4680 5.9607 4.9430 5.0895 7.1095 6.4188 6.3972 6.4447 6.5007 6.8803 1.5721 5.7897 1.7176 1.6981 1.6909 6.1265 2.5534 1.8277 1.9132 2.1707 3.7653 1.2839 1.2521 1.2476 1.2469 2.1667 2.3866 1.4465 1.3665 1.3634 4.7971 1.4444 4.4559 5.9910 6.0385 1.4085 1.3890 1.3863 1.3359 1.3415 1.3821 1.3821 2.1522 2.2855 2.1971 2.0627 1.4777 1.4971 1.4834 1.5185 3.0034 3.1407 1.2152 2.5082 1.0841 1.0844 1.0904 1.1519 1.1412 1.1234 1.1677 14.3593 2.9598 1.8300 1.4651 1.4543 3.3818 2.3528 2.4524 5.1218 6.9009 4.7706 2.3676 2.5145 2.3920 2.6621 2.3178 2.2749 2.3194 2.4096 5.5533 6.0158 5.7932 6.1557 6.2168 6.1063 6.1308 6.2002 1.0868 1.0870 1.0872 1.0874 1.0907 1.0907 1.0899 1.0905 1.0940 1.0936 1.0942 1.0945 1.0968 1.0983 1.0978 1.0978 1.1008 1.1014 1.0970 1.1006
irintensity: 0.3370 0.6524 0.2054 0.5628 1.3622 1.1401 0.3490 0.0610 0.2410 0.7368 0.3610 2.2816 6.8024 2.3975 1.9963 9.7039 4.2919 0.8608 2.0486 8.7519 8.5822 11.4454 19.9702 0.1797 0.0482 0.6176 0.4303 27.2725 27.8269 17.3372 129.1507 169.3581 71.1133 46.6290 39.6573 0.8762 0.4561 1.4622 8.5914 17.0264 74.0230 16.3574 128.6551 14.0073 58.7085 78.6253 35.7287 4.7236 15.6516 53.1888 126.2501 1.0543 0.6199 0.4429 0.0958 5.0383 3.0757 7.8509 0.1088 0.5722 8.4591 0.2698 0.2738 2.4441 1.6174 0.4508 0.4143 0.0622 0.1675 0.3958 0.5962 0.6974 20.4125 0.7863 4.6876 14.8430 8.0992 6.4467 27.8122 42.3077 44.0330 181.9443 14.8440 47.9632 0.1513 0.4416 1.5408 4.6449 0.9587 2.3299 3.3616 242.0301 59.5273 8.2302 0.8797 7.9178 26.7550 19.0858 14.2831 4.8704 56.3284 3.2465 18.3820 4.4881 53.6856 50.9370 143.1903 2.1933 3.0790 12.2609 2.8827 2.3239 54.3896 2.0618 0.6622 5.6290 12.0669 10.8208 6.1910 1.7618 0.2650 0.2268 6.1963 5.7384 1.6895 2.4262 21.2211 1.9276 11.1092 3.5575 10.9150 6.0227 7.7405 9.9181 9.2212 14.0657 6.1801 7.3744
temp: 298.150 k
press: 1.00000 atm
elementType: 6 6 6 6 1 6 1 6 1 1 1 6 6 6 6 1 6 1 6 1 1 1 7 6 6 6 6 6 1 6 1 6 1 1 1 6 6 6 6 1 6 1 6 1 1 1 15 8
symmnumber: 1
zpe: 1004034.7 jmol-1
zpe.correction: 0.382417 hartree
zpe.thermalcorrener: 0.405807 hartree
zpe.thermalcorrenthalpy: 0.406752 hartree
zpe.thermalcorrgfe: 0.325701 hartree
zpe.sumelectzpe: -1434.376283 hartree
zpe.sumelectthermal: -1434.352892 hartree
zpe.sumelectthermalent: -1434.351948 hartree
zpe.sumelectthermalfe: -1434.432998 hartree
dipole: 3.5371 2.2659 -2.7945
dipole: 5.0452
quadrupole: -150.5937 -140.2944 -168.4957
quadrupole: -5.1132 -10.4049 8.1843
quadrupole: 2.5342 12.8336 -15.3677 -5.1132 -10.4049 8.1843
hfenergy: -1434.7586996 hartree
pointgroup: C01 [X(C25H20N1O1P1)]
dipole: 1.391615 0.8914654 -1.0994247 debye
polarizability: 413.4195298|26.1056454|519.2662075|-61.9358944|7.4832116|309.3724856 unknown
InChI: InChI=1/25C.N.O.P.20H
charge 0 multiplicity 3
48 atoms
C  1.73691771 0.65551526 0.55615983
C  1.42230725 1.53320835 1.60105765
C  2.62093263 1.05049924 -0.4546034
C  1.98345209 2.80755863 1.62611734
H  0.73283171 1.21392913 2.38577937
C  3.1830873 2.32468602 -0.42047073
H  2.87119254 0.36892555 -1.27098838
C  2.85936368 3.20388508 0.61439842
H  1.73382402 3.49491942 2.4372063
H  3.87424637 2.63441417 -1.2073202
H  3.29525396 4.20548455 0.63339094
C  1.87220231 -2.18804854 -0.27942292
C  2.53204228 -3.11032974 0.54261511
C  2.00543497 -2.26754148 -1.67198945
C  3.33637427 -4.09574045 -0.02603556
H  2.40659213 -3.05711175 1.62652024
C  2.81127504 -3.25620417 -2.23391363
H  1.47190374 -1.56485669 -2.31533186
C  3.47755578 -4.1667192 -1.41251291
H  3.85069963 -4.81430245 0.61588183
H  2.91412945 -3.31959207 -3.31939239
H  4.10671967 -4.94145671 -1.8570395
N  -0.31744443 -0.57771171 -0.67251893
C  -1.52894364 0.00936969 -0.3477225
C  -2.67122012 -0.83829954 -0.10485691
C  -3.99704793 -0.33873874 -0.13931125
C  -2.49659303 -2.22682998 0.12322214
C  -5.08038045 -1.18100712 0.07549606
H  -4.1758023 0.71499427 -0.35879073
C  -3.58847196 -3.05927838 0.33280332
H  -1.49090103 -2.6506338 0.15724506
C  -4.88803161 -2.54503808 0.31720789
H  -6.09232674 -0.76982776 0.04261552
H  -3.42327717 -4.12386184 0.51534996
H  -5.74416172 -3.20221079 0.48496077
C  -1.51063199 1.47815524 -0.32583097
C  -2.23355168 2.20515984 0.64066556
C  -0.68093787 2.18937686 -1.21679382
C  -2.13847806 3.59244948 0.69925883
H  -2.84657619 1.67487861 1.371928
C  -0.58694002 3.57508144 -1.14824378
H  -0.10904033 1.64202934 -1.96857118
C  -1.3159192 4.28471131 -0.19176264
H  -2.70104071 4.13741042 1.46109394
H  0.0613546 4.10637685 -1.84902877
H  -1.23911397 5.37298657 -0.13694632
P  0.86325427 -0.93265307 0.53646957
O  0.34119475 -1.34421126 1.87732508
