program: Gaussian 16
title: 1a_optimization_1
version: ES64L-G16RevC.02
method: UwB97XD
basis: def2SVP
operation: Freq
keyword: #P
keyword: Geom=AllCheck
keyword: Guess=TCheck
keyword: SCRF=Check
keyword: GenChk
keyword: UwB97XD/def2SVP
keyword: Freq
converged: YES YES NO YES
polarizability: 3.15227254e+02 -2.79449119e+00 4.93752319e+02 -5.34019515e+01 3.12337206e+00 3.63886640e+02
1716.lowfreq: -4.7084 -0.0016 -0.0009 0.0013 9.0538 11.9898 18.2533 26.1009 32.1153
frequency: 18.1208 25.8206 30.9588 41.9249 44.6452 57.4334 63.1312 75.3576 78.1760 84.7859 97.3982 99.5046 147.1220 156.7254 175.0466 186.0718 224.7566 237.0917 248.0366 292.1421 299.1932 347.0879 364.2203 390.7593 416.1288 419.9149 421.7763 426.1083 452.7675 463.1574 471.4765 487.2263 529.1016 575.4281 621.8017 628.6452 629.2943 630.7528 632.0168 682.5772 701.3671 719.9926 722.5802 727.0125 730.6969 733.9896 740.0302 775.4218 787.8705 792.9078 814.9151 873.7975 882.1018 883.2425 893.9967 915.1553 964.9932 967.3121 975.0476 979.4457 1015.3900 1016.8333 1018.7116 1019.4872 1020.2916 1026.5200 1028.3712 1036.4639 1045.3451 1050.2717 1051.8275 1053.7483 1057.0239 1058.7067 1058.8107 1060.9143 1104.0636 1108.2158 1108.4990 1110.1645 1118.6127 1129.8034 1167.6003 1167.7598 1167.9901 1168.2891 1185.5951 1189.7306 1190.4354 1192.5059 1194.8439 1201.8092 1297.3136 1322.3916 1328.6692 1332.0567 1332.6167 1363.8079 1366.7634 1367.5513 1369.5658 1474.7024 1477.8367 1484.1823 1485.2821 1518.9296 1523.4226 1532.6663 1537.6076 1658.4642 1660.7478 1663.5320 1666.5079 1673.5522 1676.9463 1686.8615 1688.6188 1722.8775 3205.3122 3205.5796 3206.5318 3207.3260 3210.5317 3210.7672 3213.5528 3214.8530 3217.1499 3217.6096 3219.0132 3221.8862 3224.1050 3225.1332 3225.5388 3227.9005 3229.7913 3230.8789 3231.5506 3233.0487
redmass: 5.8202 6.6083 6.0041 5.8737 5.0826 4.3700 4.4620 4.6551 4.8611 4.5395 4.1725 6.0325 6.6917 6.5299 5.0659 5.4865 4.6760 5.2638 5.1548 5.4940 8.0622 7.1038 7.6124 7.9564 2.8351 2.8576 2.9493 2.8718 4.3425 4.2154 3.8550 9.3104 3.8965 4.4414 6.2327 6.3912 6.1975 6.3922 6.4135 3.9951 6.3617 1.6227 1.7854 1.6789 2.0497 4.0451 4.7796 1.6825 1.8209 2.0083 2.3349 1.2554 1.2439 1.2528 1.2424 5.6084 1.4310 1.3767 1.4461 1.3620 5.8941 5.4977 2.6748 3.8191 2.3070 1.3793 1.3891 1.3926 1.3569 1.3536 1.3572 1.4825 2.3433 2.2249 2.1761 1.9336 1.5326 1.9213 1.4451 1.4553 2.0350 3.1055 1.0829 1.0857 1.0824 1.0848 1.8888 1.2048 6.9593 1.1326 1.4319 1.1419 3.9710 1.5331 1.5309 1.5932 1.4373 4.0079 3.7048 4.4970 5.5002 2.3453 2.3728 2.4463 2.4664 2.2399 2.2040 2.4342 2.5736 6.0780 6.0770 6.5309 6.3028 6.0898 6.0349 6.5255 6.3365 11.2087 1.0874 1.0875 1.0870 1.0872 1.0910 1.0907 1.0903 1.0905 1.0936 1.0938 1.0941 1.0942 1.0972 1.0976 1.0978 1.0975 1.1015 1.1015 1.1016 1.0993
irintensity: 0.9196 1.5429 1.1681 2.1788 0.6317 0.3835 0.2931 1.0663 0.0809 0.4497 1.3803 1.6699 9.9198 0.5647 2.2514 9.2813 0.2333 4.8879 4.0403 0.0029 9.7676 16.5920 10.3466 8.9667 0.2917 0.1182 0.2507 0.1578 3.4868 2.5413 7.8850 112.7908 64.8064 2.0179 50.1491 0.2334 1.4891 0.6852 0.0414 42.3939 2.6098 102.0969 33.6893 54.8401 82.3668 14.4720 1.2082 18.2938 47.9908 30.0328 18.8029 0.8320 0.4380 0.7221 1.1149 26.3390 4.3398 0.3716 4.0672 4.7383 3.2271 0.5829 2.8919 0.6605 0.2224 0.4852 0.3777 1.9029 0.1614 0.2995 0.0547 1.8895 8.2882 0.6946 1.8841 13.6980 6.7690 26.8138 11.5932 15.3178 9.3997 87.5642 0.1091 0.1548 0.2566 0.2594 2.4564 21.5087 119.9476 3.7728 0.2312 1.5926 98.2675 5.3795 6.1636 2.6182 0.2609 0.1645 8.4125 0.5233 4.8100 13.2347 39.5401 17.8097 12.1584 10.0581 5.4325 5.1274 5.4516 2.4419 1.5321 10.4392 1.3454 1.1116 2.8358 5.8802 5.2705 28.6263 2.6627 0.4714 0.4984 0.1320 0.8032 5.8102 2.2899 7.8640 0.4517 6.3295 4.4652 4.6467 1.7268 9.8246 8.2869 8.8221 27.8035 9.7889 7.1126 8.1981
temp: 298.150 k
press: 1.00000 atm
elementType: 6 6 6 6 6 6 6 6 6 6 6 6 6 7 15 8 6 6 6 6 6 6 6 6 6 6 6 6 1 1 1 1 1 1 1 1 1 1 1 1 1 1 1 1 1 1 1 1
symmnumber: 1
zpe: 1002301.5 jmol-1
zpe.correction: 0.381756 hartree
zpe.thermalcorrener: 0.406079 hartree
zpe.thermalcorrenthalpy: 0.407023 hartree
zpe.thermalcorrgfe: 0.323382 hartree
zpe.sumelectzpe: -1434.350190 hartree
zpe.sumelectthermal: -1434.325868 hartree
zpe.sumelectthermalent: -1434.324924 hartree
zpe.sumelectthermalfe: -1434.408564 hartree
dipole: -0.2078 2.6109 -1.5817
dipole: 3.0597
quadrupole: -153.7165 -138.8956 -179.1712
quadrupole: -0.2159 -5.7256 6.8129
quadrupole: 3.5446 18.3655 -21.9101 -0.2159 -5.7256 6.8129
hfenergy: -1434.7319468 hartree
pointgroup: C01 [X(C25H20N1O1P1)]
dipole: -0.0817387 1.0272129 -0.622293 debye
polarizability: 315.2272538|-2.7944912|493.7523194|-53.4019515|3.1233721|363.8866397 unknown
InChI: InChI=1/25C.N.O.P.20H
charge 0 multiplicity 3
48 atoms
C  -0.1967227 3.98983587 0.36469513
C  -0.59876862 3.02625516 1.29072911
C  -0.74033142 1.69697333 0.90070516
C  -0.46901342 1.32316968 -0.42123658
C  -0.06547148 2.29203725 -1.34817121
C  0.06469317 3.62213899 -0.95540751
C  -0.51153688 -0.11844826 -0.82502963
C  -1.5692462 -1.03771341 -0.29769934
C  -2.86765414 -0.57281666 -0.05651892
C  -3.84597001 -1.44866179 0.41125186
C  -3.53408082 -2.78804572 0.64604202
C  -2.24104205 -3.25539871 0.40571144
C  -1.26193314 -2.38621313 -0.06791355
N  0.37811682 -0.55847718 -1.6037532
P  1.40969254 -1.27201197 2.14221041
O  1.0251529 -1.6345817 3.56105929
C  2.15153565 0.38246019 2.03068581
C  2.12238642 1.1767982 3.18469258
C  2.59197338 2.48794726 3.13931416
C  3.0783731 3.0154476 1.9430723
C  3.10001464 2.22814066 0.79014719
C  2.63619753 0.91594684 0.82881131
C  2.50347302 -2.50307841 1.37220586
C  3.08088184 -3.47598944 2.20021913
C  3.90201435 -4.45780108 1.64941754
C  4.13958061 -4.48182708 0.27426423
C  3.54647573 -3.5282601 -0.55445201
C  2.72187297 -2.54390886 -0.01202859
H  1.72921822 0.75942975 4.11439248
H  2.6377193 0.31950237 -0.08595554
H  2.57417736 3.10152788 4.04302581
H  3.47217427 2.64159173 -0.14973659
H  3.43748212 4.04653587 1.90593294
H  2.88481815 -3.45648425 3.27466203
H  2.23138694 -1.82364528 -0.67200935
H  4.35817521 -5.20901249 2.29835413
H  3.71748343 -3.55566591 -1.63292202
H  4.78288286 -5.25351511 -0.15507715
H  -3.11703028 0.47470349 -0.23892065
H  -0.24701967 -2.74744324 -0.24856483
H  -4.85785372 -1.08071592 0.59495022
H  -1.99124975 -4.30193684 0.59319543
H  -4.30089797 -3.47003221 1.02069585
H  -1.04072522 0.94275789 1.6316917
H  0.14188645 1.99820313 -2.37934551
H  -0.79765296 3.30957049 2.32653059
H  0.37478778 4.37482075 -1.68365073
H  -0.08722434 5.03179439 0.67417722
