program: Gaussian 16
title: 1a_optimization_1
version: ES64L-G16RevC.02
method: UwB97XD
basis: def2SVP
operation: Freq
keyword: #P
keyword: Geom=AllCheck
keyword: Guess=TCheck
keyword: SCRF=Check
keyword: GenChk
keyword: UwB97XD/def2SVP
keyword: Freq
converged: YES YES NO YES
polarizability: 3.93896050e+02 2.35931960e+01 4.46452691e+02 2.65865786e+01 -4.60935023e+01 3.19962669e+02
1716.lowfreq: -8.4137 -7.8978 -0.0018 -0.0014 0.0013 7.7541 19.8987 33.0916 38.7793
frequency: 18.9000 33.0578 38.7700 40.0183 49.4942 52.8377 65.5315 68.9315 83.3241 98.6959 127.9948 172.1132 178.4676 205.6255 212.4879 235.8044 250.6385 270.0029 299.2505 305.0761 318.3381 410.6003 416.0849 418.2411 421.5447 424.3921 440.7990 446.6735 470.7652 499.8603 538.5917 545.9148 584.9493 629.7276 630.3166 632.2337 632.6410 656.4197 707.3173 716.2435 718.6394 724.1894 726.6604 729.2777 729.3906 742.2435 780.2383 788.3012 795.1045 834.0015 862.9222 867.8079 881.7768 884.2015 888.2020 944.6629 969.6670 972.6694 974.1029 986.4293 1013.3780 1017.6310 1018.6074 1019.6037 1021.5668 1026.1720 1030.3154 1031.8129 1044.0314 1051.1075 1051.5703 1053.7199 1056.3380 1057.1975 1057.3932 1061.5460 1099.7302 1104.8064 1105.6788 1109.4292 1136.2312 1149.7580 1166.3304 1167.8791 1168.2462 1168.6848 1178.5450 1185.9659 1192.8581 1193.2277 1207.6696 1241.1616 1314.6020 1318.3374 1325.8380 1329.0905 1343.5775 1364.2046 1366.1432 1367.9672 1375.0003 1476.8266 1479.5498 1484.8733 1488.1137 1523.7529 1526.0347 1531.8144 1539.6570 1663.0779 1664.6609 1666.4299 1667.2786 1682.3332 1683.6063 1686.9102 1693.0190 1720.4682 3201.7076 3204.2542 3205.5831 3207.8611 3207.8889 3210.4494 3211.7729 3216.2355 3216.5513 3216.9949 3220.0949 3222.2877 3223.7724 3224.6024 3228.3531 3228.8702 3229.3624 3232.3109 3234.7897 3236.7325
redmass: 5.0280 4.0459 4.9817 4.4223 4.9645 4.6578 4.5178 4.2878 4.1589 5.2778 5.4731 5.5470 7.2676 6.2867 4.6992 5.1102 4.8606 4.8386 5.9829 6.9699 6.9765 2.8260 3.0239 3.0741 3.2908 3.8096 5.5136 5.3824 4.3528 4.5134 4.6320 5.4477 6.1440 6.3652 6.4011 6.3964 6.3737 5.0739 5.9162 1.8481 2.2955 1.8064 1.7404 1.9434 3.3169 5.1668 1.8848 1.9588 2.3589 2.6454 4.2048 1.4387 1.2515 1.2481 1.2485 1.9686 1.3918 1.3775 2.6002 1.6080 1.5227 6.0167 5.9517 5.2137 4.3640 1.3942 1.3823 1.3858 1.3492 1.3558 1.4319 1.4059 2.0107 2.0448 2.2118 1.9543 1.4504 1.5038 1.4020 1.4611 3.0479 2.9546 1.0988 1.0892 1.0900 1.0835 1.1835 1.1671 1.1092 1.1247 2.8853 13.1368 2.0423 1.4394 1.4630 1.5212 2.0861 5.2465 4.5663 4.7245 7.4014 2.3406 2.3642 2.4418 2.5138 2.3744 2.3015 2.4939 2.6476 6.4328 6.3155 6.2939 6.3044 6.1812 6.3139 6.5389 6.3610 11.2727 1.0879 1.0869 1.0874 1.0876 1.0897 1.0897 1.0911 1.0937 1.0938 1.0914 1.0951 1.0976 1.0967 1.0952 1.0994 1.1015 1.1009 1.0962 1.0995 1.0982
irintensity: 0.0748 0.3643 0.8349 0.4627 0.2360 0.8198 0.3842 0.4952 0.6809 0.9105 0.1111 6.1034 10.1067 6.0722 1.8117 13.1992 2.7980 0.8573 1.7816 7.6420 3.1007 0.4185 0.3435 0.9319 2.7992 4.3236 21.1565 51.7799 17.2124 1.7956 92.0002 302.4743 60.5735 1.3166 0.0316 0.1094 0.0411 36.3342 3.6064 41.9188 15.5237 155.6693 48.8221 23.6511 118.3513 125.8282 9.9592 19.2341 16.4594 9.1785 297.8073 49.1097 0.8461 0.0706 0.4843 72.5660 0.9797 0.4473 47.6542 12.3696 1.2165 0.4327 0.8286 2.3097 0.9399 0.1642 0.1162 1.2713 0.3096 0.2712 2.1023 2.7523 6.1123 11.2308 4.3126 7.2486 5.4661 29.6060 14.4816 16.0480 75.1177 162.0575 3.3386 0.1955 0.1338 0.2575 26.2752 0.4643 0.4860 0.3088 5.0066 268.2844 106.1112 4.9429 9.6745 35.5146 189.6353 0.4195 6.7058 1.8880 15.5454 7.8066 57.8564 23.3492 28.9944 2.9854 3.0430 2.7062 13.9794 91.0294 25.0594 2.0871 2.3153 6.4120 5.7844 147.4432 9.1181 788.3446 0.5929 0.1022 0.3355 0.0391 1.4669 1.0742 2.2291 8.2948 1.8543 5.6106 12.6831 13.6435 7.6442 8.6210 8.3506 16.4832 12.5446 5.1242 10.6971 2.6933
temp: 298.150 k
press: 1.00000 atm
elementType: 6 6 6 6 1 6 1 6 1 1 1 6 6 6 6 1 6 1 6 1 1 1 7 6 6 6 6 6 1 6 1 6 1 1 1 6 6 6 6 1 6 1 6 1 1 1 15 8
symmnumber: 1
zpe: 1010850.5 jmol-1
zpe.correction: 0.385013 hartree
zpe.thermalcorrener: 0.408108 hartree
zpe.thermalcorrenthalpy: 0.409052 hartree
zpe.thermalcorrgfe: 0.329857 hartree
zpe.sumelectzpe: -1434.460161 hartree
zpe.sumelectthermal: -1434.437066 hartree
zpe.sumelectthermalent: -1434.436122 hartree
zpe.sumelectthermalfe: -1434.515317 hartree
dipole: -2.7035 0.0626 -5.3714
dipole: 6.0137
quadrupole: -146.7798 -142.5867 -170.9720
quadrupole: 4.6191 -3.0520 -3.5308
quadrupole: 6.6664 10.8594 -17.5258 4.6191 -3.0520 -3.5308
hfenergy: -1434.8451736 hartree
pointgroup: C01 [X(C25H20N1O1P1)]
dipole: -1.0636285 0.0246406 -2.1132645 debye
polarizability: 393.8960504|23.593196|446.4526912|26.5865786|-46.0935023|319.9626691 unknown
InChI: InChI=1/25C.N.O.P.20H
charge 0 multiplicity 1
48 atoms
C  2.72682103 0.82543366 0.59920136
C  3.91423346 0.48150395 1.25646967
C  2.72936 1.86415573 -0.3390979
C  5.09564911 1.16340976 0.96966483
H  3.90624328 -0.31830288 2.00112861
C  3.91325907 2.54275769 -0.62585464
H  1.80140438 2.14790115 -0.84069115
C  5.09583277 2.19271694 0.02733169
H  6.01890434 0.89364654 1.48759886
H  3.91101827 3.35364481 -1.35794836
H  6.02170234 2.7281975 -0.19623512
C  1.16729993 -1.47869605 -0.23222786
C  1.02148399 -2.78843461 0.23242397
C  1.21733314 -1.22824836 -1.60898437
C  0.91076097 -3.84221751 -0.67433886
H  0.9827683 -2.97080962 1.30865106
C  1.10619401 -2.28269546 -2.51250187
H  1.33741207 -0.20728162 -1.9815116
C  0.949636 -3.58967191 -2.04531555
H  0.7897209 -4.86412631 -0.30755553
H  1.14135638 -2.08497173 -3.58631525
H  0.85965436 -4.41509756 -2.75559312
N  0.0075859 0.96465582 0.62981264
C  -1.22813607 0.68837196 0.42457821
C  -1.79076582 -0.69697007 0.50396109
C  -2.26074704 -1.32479338 -0.65669918
C  -1.80078671 -1.38699348 1.72031731
C  -2.70830285 -2.64210032 -0.60409917
H  -2.25567382 -0.78493279 -1.60664423
C  -2.27516204 -2.69709213 1.7722035
H  -1.41700238 -0.90476939 2.62049433
C  -2.71991957 -3.32860888 0.61170231
H  -3.05100236 -3.1351929 -1.51645434
H  -2.28478944 -3.23061163 2.72527614
H  -3.07672536 -4.36035002 0.65283917
C  -2.15868574 1.79997176 0.07646152
C  -3.54872466 1.614022 0.07481193
C  -1.64002882 3.06674625 -0.23577065
C  -4.40112818 2.67186768 -0.23807252
H  -3.97210418 0.6409073 0.32993311
C  -2.49125653 4.11876882 -0.55309027
H  -0.55835727 3.21073389 -0.22337215
C  -3.87503084 3.92316282 -0.555443
H  -5.48207402 2.51604688 -0.23111327
H  -2.07631429 5.09870537 -0.79935792
H  -4.54370926 4.75088671 -0.80337432
P  1.24179261 -0.13691112 0.999407
O  1.25635246 -0.65456337 2.4087646
