program: Gaussian 09
title: 000004437
version: EM64L-G09RevD.01
frameworkgroup: C1[X(C10H5O9S3)]
method: RPBEPBE
basis: SDD
operation: Freq
keyword: #p
keyword: freq=noraman
keyword: PBEPBE/SDD
title: #p freq=noraman PBEPBE/SDD
converged: YES YES NO NO
title: Mulliken charges:
elementType: S S S O O O O O O O O O C C C C C C C C C C H H H H H
charge: 1.004861 1.019840 1.016226 -0.653886 -0.650883 -0.653922 -0.656702 -0.656502 -0.666856 -0.664528 -0.664788 -0.664316 0.452759 0.442447 -0.303172 -0.119255 -0.488483 -0.301355 -0.478000 -0.375508 -0.117825 -0.260601 0.295240 0.317611 0.288642 0.292289 0.246668
chargesum: -3.00000
title: Mulliken charges with hydrogens summed into heavy atoms:
elementType: S S S O O O O O O O O O C C C C C C C C C C
charge: 1.004861 1.019840 1.016226 -0.653886 -0.650883 -0.653922 -0.656702 -0.656502 -0.666856 -0.664528 -0.664788 -0.664316 0.452759 0.442447 -0.303172 -0.119255 -0.193243 0.016256 -0.189358 -0.083219 -0.117825 -0.013933
polarizability: 3.31255124e+02 1.07183501e+01 2.43920946e+02 8.86568309e-02 2.46989635e-02 1.36480159e+02
1716.lowfreq: -5.5473 -4.9710 -3.2987 -0.0021 -0.0019 -0.0019 11.0189 20.5853 33.4732
frequency: 9.9652 20.3377 33.4561 52.0694 71.9305 74.0088 88.0101 103.4949 136.3367 151.6028 158.6216 168.0708 193.2830 194.5152 236.1915 244.7891 267.5911 284.8401 295.1019 297.8600 352.7587 355.3750 369.1214 374.3496 376.6937 394.7078 444.2435 449.7914 453.1782 461.4595 479.5467 566.9828 571.0485 576.7301 577.5748 647.5628 651.9909 713.2548 717.0344 721.6688 772.4014 777.1109 829.2214 836.7743 862.0008 863.7047 864.5697 869.8141 871.8675 873.8002 895.7695 904.6341 920.8551 943.9671 953.7309 1047.4378 1054.8822 1134.6929 1164.9456 1187.7194 1258.9446 1282.6724 1371.7155 1383.7909 1399.9651 1416.0960 1476.7282 1552.1749 1577.5108 1607.3699 3129.4037 3132.8716 3141.6189 3145.4379 3163.2927
redmass: 15.9779 15.9196 14.8294 10.8527 15.7002 5.6703 16.0907 8.9911 12.1157 9.0988 15.4304 9.4074 14.4295 14.8666 8.0101 10.7000 11.5886 6.7384 8.8714 5.9527 12.3738 9.5910 11.0223 16.8130 12.4768 12.4591 16.2831 3.4003 14.0866 18.3833 5.6247 5.3941 8.9975 8.1767 4.8881 8.2035 2.9677 14.5602 15.9414 16.3116 1.7974 5.6596 2.6765 8.5353 9.4848 13.8487 18.9393 19.0103 12.6114 16.3470 1.4706 1.3948 6.0764 1.4937 1.5271 2.2396 1.9199 1.7951 1.5855 1.7518 1.7429 1.8853 3.0021 4.2732 8.1532 3.5930 3.7847 7.4833 7.8360 7.2583 1.0908 1.0904 1.0874 1.0909 1.0971
irintensity: 0.0417 0.1124 0.7499 11.5421 3.3688 0.2471 2.2798 0.1906 1.0628 0.1146 2.1091 0.0048 4.4634 7.6402 1.4296 15.7872 23.5437 3.1623 0.8584 0.2511 10.9753 10.3937 19.4042 4.0203 0.1631 7.7758 191.1916 12.1541 170.5197 53.3492 43.7806 1.8117 13.3178 2.3888 15.2919 2.7611 0.0739 199.8287 212.6540 34.2609 0.4339 25.4027 8.8137 31.7979 126.6371 132.2461 26.2312 193.3144 240.8984 142.2315 0.3486 0.8264 1.8525 0.2394 21.1242 27.6736 16.3923 1.9629 2.7727 8.9067 7.0793 4.8080 4.8189 1.0656 2.7677 5.8909 24.6945 22.6516 1.9702 9.6973 7.0449 2.2039 3.1006 14.4019 3.2505
temp: 298.150 k
press: 1.00000 atm
elementType: 16 16 16 8 8 8 8 8 8 8 8 8 6 6 6 6 6 6 6 6 6 6 1 1 1 1 1
symmnumber: 1
zpe: 370882.1 jmol-1
zpe.correction: 0.141262 hartree
zpe.thermalcorrener: 0.162845 hartree
zpe.thermalcorrenthalpy: 0.163789 hartree
zpe.thermalcorrgfe: 0.087304 hartree
zpe.sumelectzpe: -2253.187641 hartree
zpe.sumelectthermal: -2253.166058 hartree
zpe.sumelectthermalent: -2253.165114 hartree
zpe.sumelectthermalfe: -2253.241599 hartree
dipole: 1.2389 1.0164 -0.0192
dipole: 1.6026
quadrupole: -395.6776 -275.5214 -186.9846
quadrupole: 3.2110 0.0030 0.0385
quadrupole: -109.6164 10.5398 99.0766 3.2110 0.0030 0.0385
hfenergy: -2253.3289028 hartree
pointgroup: C01 [X(C10H5O9S3)]
dipole: 0.4927638 0.3926475 -0.0238352 debye
polarizability: 331.4404007|9.4141987|243.6128894|-4.5767537|-1.5020478|136.6029388 unknown
InChI: InChI=1S/C10H5O9S3/c11-20(12,13)7-1-2-9-6(3-7)4-8(21(14,15)16)5-10(9)22(17,18)19/h1-5H
charge -3 multiplicity 1
27 atoms
S  -1.71344 3.098469 0.002849
S  -3.475048 -2.384349 0.111571
S  4.593092 -0.844666 -0.096089
O  -1.062746 3.703367 -1.393741
O  -3.365253 3.117545 0.037381
O  -1.005037 3.73396 1.357087
O  -4.293363 -2.090059 1.516206
O  -4.38127 -2.107491 -1.241705
O  -2.679837 -3.840028 0.095939
O  5.249333 -0.213451 -1.478377
O  5.297011 -0.236479 1.272836
O  4.449773 -2.494584 -0.106063
C  0.113197 0.776884 -0.01173
C  0.371538 -0.656423 -0.002242
C  -1.259153 1.202954 0.014575
C  -2.036876 -1.085086 0.058928
C  -0.735977 -1.569975 0.033462
C  -2.32823 0.311006 0.049668
C  1.73191 -1.124672 -0.028329
C  1.23047 1.680738 -0.047082
C  2.774369 -0.209018 -0.061748
C  2.541813 1.196768 -0.07155
H  -0.57893 -2.65536 0.04126
H  -3.35434 0.694022 0.068659
H  1.958915 -2.197416 -0.02327
H  1.030073 2.756329 -0.054605
H  3.397307 1.879317 -0.10009
