program: Gaussian 09
title: 000075184
version: EM64L-G09RevD.01
frameworkgroup: C1[X(C11H7NO4)]
method: RPBEPBE
basis: SDD
operation: Freq
keyword: #p
keyword: freq=noraman
keyword: PBEPBE/SDD
title: #p freq=noraman PBEPBE/SDD
converged: YES YES NO NO
title: Mulliken charges:
elementType: O O O O N C C C C C C C C C C C H H H H H H H
charge: -0.420486 -0.231139 -0.186736 -0.202265 0.020878 0.159529 0.412560 0.213927 0.265759 -0.429350 -0.434385 -0.354855 -0.373950 -0.231788 -0.229608 0.087556 0.249252 0.250024 0.276560 0.281827 0.242769 0.245474 0.388448
chargesum: 0.00000
title: Mulliken charges with hydrogens summed into heavy atoms:
elementType: O O O O N C C C C C C C C C C C
charge: -0.032037 -0.231139 -0.186736 -0.202265 0.020878 0.159529 0.412560 0.213927 0.265759 -0.180098 -0.184361 -0.078295 -0.092123 0.010981 0.015866 0.087556
polarizability: 1.77859677e+02 -2.96073898e+00 1.86965000e+02 4.52440411e+00 -1.33300749e+01 6.61084972e+01
1716.lowfreq: -13.2955 -6.1361 -2.5893 -0.0003 0.0003 0.0005 52.6177 62.7941 99.7830
frequency: 52.6108 62.7933 99.7826 139.3273 166.0103 188.7706 218.8757 223.0675 302.3949 330.1632 370.7055 430.0093 440.0515 466.5142 479.4590 526.9691 564.3602 572.9724 599.8409 614.2062 636.5860 692.7272 698.9107 719.6313 767.7658 781.6345 785.2899 790.2879 847.4424 911.5467 932.6407 951.2128 984.6354 991.3223 999.9925 1062.9164 1088.5345 1099.7845 1163.9550 1173.0524 1201.1089 1212.3826 1221.2484 1241.6912 1322.2042 1372.1767 1378.4504 1400.4981 1403.6070 1432.6076 1450.8674 1515.7789 1576.6827 1592.6466 1621.6755 1640.7588 3135.9846 3139.1869 3160.5310 3164.5961 3180.1865 3183.2269 3523.0757
redmass: 7.0085 12.6483 11.2104 5.3279 5.5596 12.9297 4.5238 6.0632 7.6736 6.9291 6.6991 5.2123 5.9330 3.4544 5.1310 5.6914 3.5942 2.6108 3.7951 2.7036 3.0161 5.3645 6.2547 5.3738 2.4253 6.9273 3.1558 1.7419 2.0166 6.6495 1.3745 1.4573 3.9660 1.5973 1.3977 2.9037 2.2493 1.9370 1.5044 1.3108 1.6606 2.6815 2.6069 1.8794 2.1719 6.1444 3.4190 4.2552 5.1475 2.5320 2.5743 4.7054 7.2708 5.5374 7.5933 8.4170 1.0885 1.0884 1.0935 1.0930 1.0971 1.0972 1.0641
irintensity: 2.6281 0.5776 2.9185 0.0283 4.3363 0.6550 0.5425 4.6342 2.2860 0.4986 6.0546 0.7654 4.4603 2.0576 3.8688 1.8616 12.3738 24.7224 47.4383 86.3664 21.2322 5.8179 8.2082 42.3932 54.6798 10.1644 0.1323 0.7998 72.2705 22.3918 2.6525 0.7122 70.6233 6.8366 2.6350 124.0869 23.4859 138.5477 4.4328 17.6459 16.0293 105.8928 81.8769 8.6012 76.2892 121.5090 16.3015 3.5788 7.4930 3.5351 4.2882 36.4579 15.3643 16.8570 41.3822 145.3307 1.0744 4.3178 13.6053 12.7684 6.0917 4.5544 51.5181
temp: 298.150 k
press: 1.00000 atm
elementType: 8 8 8 8 7 6 6 6 6 6 6 6 6 6 6 6 1 1 1 1 1 1 1
symmnumber: 1
zpe: 418692.5 jmol-1
zpe.correction: 0.159472 hartree
zpe.thermalcorrener: 0.172033 hartree
zpe.thermalcorrenthalpy: 0.172977 hartree
zpe.thermalcorrgfe: 0.120213 hartree
zpe.sumelectzpe: -777.832558 hartree
zpe.sumelectthermal: -777.819996 hartree
zpe.sumelectthermalent: -777.819052 hartree
zpe.sumelectthermalfe: -777.871816 hartree
dipole: 4.8514 3.7466 0.0240
dipole: 6.1297
quadrupole: -74.9872 -84.7805 -98.6804
quadrupole: -9.6691 -0.5172 1.2726
quadrupole: 11.1622 1.3689 -12.5310 -9.6691 -0.5172 1.2726
hfenergy: -777.9920292 hartree
pointgroup: C01 [X(C11H7N1O4)]
dipole: -2.2457734 0.8764822 -0.0650719 debye
dipolederiv: -0.6658503 -0.4607589 -0.2760043 -0.4624496 -0.8415466 -0.2459267 -0.3215932 -0.2475338 -0.5059238 -0.7883715 0.0079192 0.2472193 -0.0529106 -0.5487488 -0.2255668 0.1060707 -0.1486188 -0.6180789 -0.558559 0.3174066 0.0163726 0.289729 -0.6365297 -0.1894097 -0.0329363 -0.1548338 -0.340891 -0.5986348 0.0111006 -0.2035849 0.0232033 -0.4724219 -0.1802167 -0.1373705 -0.174065 -0.5125288 1.3481341 -0.4713873 0.2907901 -0.3702654 0.8047964 0.4102375 0.2326847 0.346433 0.6728598 -0.0914078 0.0859765 -0.0061727 -0.0091209 0.2473305 -0.0677809 -0.0334775 -0.0153437 -0.0319479 -0.162665 -0.0618638 -0.0165582 0.0011542 -0.0526761 -0.00945 -0.0219874 0.0301919 0.0624058 -0.3862929 -0.0850016 0.0310961 0.1303928 -0.1142121 -0.0191769 0.0625373 -0.0590451 -0.0195688 -0.3968957 0.1533806 -0.0779729 -0.0851003 0.0601294 -0.0514648 -0.0989108 -0.0245578 -0.008199 0.1290965 -0.0589794 0.0266815 0.0635999 0.068742 0.0364987 0.0407649 0.0350298 -0.1413543 0.1536852 0.0441404 0.0067776 -0.1173745 0.1461631 0.0211138 -0.0037462 0.0470923 -0.1342655 0.1643866 0.1089954 0.0329937 -0.061086 -0.0160962 0.0075039 -0.0311975 0.0101415 -0.0861362 0.1999551 -0.1636659 0.0064969 0.101436 -0.1157606 0.0201851 0.1150014 -0.0349341 -0.067347 -0.1204547 -0.2037639 -0.0294164 -0.19478 0.0204045 0.0347909 -0.0319827 0.046854 -0.1385163 -0.1291397 0.249775 0.0280275 0.2343321 -0.0639254 0.055018 0.0463005 0.0571044 -0.1357355 1.589123 0.4451405 -0.1270561 0.4237325 0.9897814 0.5382701 0.0268812 0.4289454 0.7907912 -0.0844396 0.0321821 -0.007942 -0.0368466 0.0892883 -0.0114155 -0.0180722 -0.0241056 0.1508716 -0.0751714 -0.0069579 -0.0152949 0.0594612 0.0882279 -0.0053974 -0.0096942 -0.0217042 0.1502898 0.0839675 -0.0570499 -0.0042382 -0.0587761 0.0227345 -0.005949 0.0120879 -0.0125231 0.1467769 0.0985193 0.0554603 -0.0004256 0.0321954 0.0533619 0.0046807 -0.0292386 -0.0034402 0.1549257 0.0435057 0.0727122 0.0140806 0.0882284 -0.0570411 -0.0338077 0.0080355 -0.0267694 0.1567643 0.0277103 -0.0737497 -0.028635 -0.0878638 -0.0280059 -0.0357478 -0.0287856 -0.0275278 0.153992 0.2197991 0.0589889 0.0927653 0.0891088 0.3560046 -0.0469889 0.1486288 -0.02679 0.3008158 unknown
polarizability: 176.6540468|-1.0839353|185.5490922|5.9853468|21.6936551|68.7300352 unknown
InChI: InChI=1S/C11H7NO4/c13-11(14)8-5-1-3-7-4-2-6-9(10(7)8)12(15)16/h1-6,13H
charge 0 multiplicity 1
23 atoms
O  2.402324 2.30308 0.527864
O  2.354003 0.574763 -1.019239
O  2.07425 -2.677537 -0.109733
O  2.024398 -0.920697 1.33992
N  1.496064 -1.655304 0.41657
C  -0.45163 -0.023221 0.050144
C  -1.899537 0.070074 -0.022018
C  0.297809 1.208976 0.142858
C  0.0957 -1.356372 0.015585
C  -2.542441 1.341745 0.140489
C  -2.690942 -1.102504 -0.254581
C  -0.372887 2.426875 0.33605
C  -0.689132 -2.483899 -0.246434
C  -1.795146 2.49626 0.361987
C  -2.095992 -2.354327 -0.408066
C  1.758275 1.273415 -0.166308
H  -3.636218 1.385145 0.088521
H  -3.780063 -0.994757 -0.309431
H  0.221484 3.339956 0.428094
H  -0.204937 -3.463657 -0.280728
H  -2.287888 3.461809 0.510863
H  -2.701762 -3.243746 -0.604274
H  3.359567 2.318122 0.255867
