program: Gaussian 16
title: Title Card Required
version: ES64L-G16RevC.01
method: RwB97XD
basis: def2TZVPP
operation: Freq
keyword: #N
keyword: Geom=AllCheck
keyword: Guess=TCheck
keyword: SCRF=Check
keyword: GenChk
keyword: RwB97XD/def2TZVPP
keyword: Freq
converged: YES YES YES YES
title: Mulliken charges:
elementType: C C C C H H H H S F F F F F Cl C C C C H C H C H H C O H H H H
charge: -0.234493 0.235183 -0.200180 0.063897 0.104814 0.113345 0.106759 0.112167 0.966312 -0.216065 -0.217455 -0.239301 -0.214411 -0.212887 -0.137976 0.063688 -0.199077 -0.196988 -0.114134 0.118451 -0.113457 0.120929 -0.115742 0.121283 0.121653 -0.021343 -0.338287 0.180258 0.121109 0.098973 0.122976
chargesum: -0.00000
title: Mulliken charges with hydrogens summed into heavy atoms:
elementType: C C C C S F F F F F Cl C C C C C C C O
charge: -0.016334 0.235183 0.018747 0.063897 0.966312 -0.216065 -0.217455 -0.239301 -0.214411 -0.212887 -0.137976 0.063688 -0.080626 -0.076059 0.007149 0.008197 0.007234 0.198738 -0.158029
1716.lowfreq: -0.0009 0.0018 0.0019 4.7318 5.0792 7.6985 37.6684 39.0233 56.4840
frequency: 37.6655 39.0124 56.4769 96.6164 112.8529 134.2348 161.5053 184.4962 208.8656 225.4973 260.7625 274.0958 302.8355 341.7491 361.0713 382.9966 406.1794 412.5341 418.1193 421.7835 438.3845 472.1711 474.4457 500.8700 538.5856 561.2111 578.9459 582.7765 594.7683 608.3258 638.3977 640.6101 657.4117 725.5171 738.4936 798.4089 815.8503 843.4561 860.1512 866.1224 873.7619 877.5141 894.9891 943.3957 960.1784 1014.2436 1018.3048 1031.0470 1033.9667 1061.4581 1066.9577 1105.0471 1115.2507 1127.5764 1133.2250 1156.7731 1166.9656 1191.4859 1220.7477 1249.8852 1274.9695 1292.3673 1300.6692 1333.1156 1346.4046 1370.2214 1399.5076 1441.4506 1477.4386 1492.7578 1500.2218 1518.4535 1552.2513 1661.8932 1683.4519 3061.7545 3118.9477 3127.1548 3130.4693 3192.7985 3194.6259 3195.5526 3197.2260 3207.1769 3215.1409 3226.9905 3922.6195
redmass: 4.4673 6.6898 10.0499 6.8832 7.2616 9.4267 5.7032 13.0626 6.0746 9.0655 6.4578 4.1946 4.5849 6.7723 3.4135 2.7375 2.8256 4.5546 2.8594 1.6759 4.9574 4.4338 10.0273 3.9065 3.6012 8.4881 12.7886 17.4976 7.2200 7.0212 6.2030 4.1501 18.5956 1.5866 3.8607 2.0894 3.6903 13.4583 5.3316 8.0325 1.5484 2.0334 2.2271 1.8063 1.4817 1.3780 2.9042 5.8488 1.3387 4.5692 2.3146 2.3139 3.6036 1.1928 2.2356 2.6595 2.1716 1.1501 1.1335 1.5291 1.3225 1.7709 2.0034 4.3639 2.0105 1.4191 1.2855 1.1866 1.0797 1.1096 2.2980 1.0726 2.3237 5.8746 5.7540 1.0647 1.0664 1.0959 1.0625 1.0902 1.0985 1.1020 1.0960 1.0911 1.0950 1.0988 1.0656
irintensity: 0.0547 0.3709 0.1082 0.3549 1.1686 1.3991 4.2096 0.6801 0.0580 0.0674 0.7392 1.0146 3.0341 6.6642 0.7682 31.8284 28.7034 2.1459 0.1584 66.8478 4.1419 22.5770 3.9504 4.0156 17.5854 7.6222 2.6916 4.7461 15.5466 4.9035 1.8215 28.0284 26.5483 47.1938 4.7989 6.6860 102.6330 326.7750 193.4629 266.6067 55.0196 107.3075 56.0285 6.9024 1.7279 0.0524 3.9288 0.7255 0.0223 0.8582 9.6208 13.2450 86.8961 2.7212 18.5810 33.3008 18.8180 0.0185 1.3078 17.3819 1.4569 16.4963 7.2880 0.0668 37.9788 1.4719 6.5146 26.8614 20.3023 0.8862 7.3207 8.4477 7.1532 1.2485 1.6743 23.9464 5.6778 3.1298 4.0987 7.6341 0.4741 0.3532 0.0527 3.8535 15.9949 11.0475 58.6847
temp: 298.150 k
press: 1.00000 atm
elementType: 6 6 6 6 1 1 1 1 16 9 9 9 9 9 17 6 6 6 6 1 6 1 6 1 1 6 8 1 1 1 1
symmnumber: 1
zpe: 594859.0 jmol-1
zpe.correction: 0.226570 hartree
zpe.thermalcorrener: 0.243629 hartree
zpe.thermalcorrenthalpy: 0.244574 hartree
zpe.thermalcorrgfe: 0.181488 hartree
zpe.sumelectzpe: -1859.057494 hartree
zpe.sumelectthermal: -1859.040434 hartree
zpe.sumelectthermalent: -1859.039490 hartree
zpe.sumelectthermalfe: -1859.102576 hartree
dipole: 0.1560 -1.5553 -0.9185
dipole: 1.8130
quadrupole: -135.4730 -114.9037 -117.0219
quadrupole: -4.7402 0.2297 -2.5644
quadrupole: -13.0068 7.5625 5.4443 -4.7402 0.2297 -2.5644
hfenergy: -1859.2840637 hartree
pointgroup: C01 [X(C11H12Cl1F5O1S1)]
dipole: 0.061364 -0.6118922 -0.3613831 debye
polarizability: 140.5603075|-5.4126192|195.2880511|-1.1646038|5.3337119|146.7053511 unknown
InChI: InChI=1/11C.Cl.5F.O.S.12H
charge 0 multiplicity 1
31 atoms
C  0.38565319 0.58568722 -0.98733999
C  -0.31306261 -0.4038026 -0.02578188
C  0.20471618 0.41811649 1.17716754
C  0.64882854 1.53121002 0.20568002
H  -0.22392642 1.00977441 -1.78147999
H  1.28236479 0.15292041 -1.41594501
H  -0.52753725 0.73773055 1.9126453
H  1.02350879 -0.08915723 1.67554086
S  2.43844089 2.04169722 0.38231549
F  2.92135757 0.52179853 0.26969409
F  2.59170205 2.2326555 -1.19838549
F  2.11425206 3.61396862 0.51430396
F  2.38488602 1.92565549 1.97466344
F  3.96605837 2.43374831 0.51813394
Cl -2.12045079 -0.30507563 -0.17254801
C  0.07747122 -1.8527338 -0.10709759
C  0.34577932 -2.44258537 -1.33597107
C  0.14504784 -2.62774316 1.04399828
C  0.68579628 -3.78316415 -1.41281187
H  0.28418224 -1.85369909 -2.24242545
C  0.48454303 -3.96851823 0.96929637
H  -0.07406448 -2.18378276 2.00678811
C  0.75794158 -4.54905889 -0.25955501
H  0.89525365 -4.22971155 -2.37555836
H  0.53623635 -4.56038858 1.8732612
C  -0.30729195 2.72595026 0.19995331
O  -0.47434904 3.34552613 1.44402512
H  0.30016773 3.87183729 1.6397251
H  -0.02178287 3.43034982 -0.58561339
H  -1.28362904 2.32066374 -0.06601671
H  1.02663072 -5.59479484 -0.31824619
