program: Gaussian 09
title: 000075171
version: EM64L-G09RevD.01
frameworkgroup: C1[X(C7H18N2O)]
method: RPBEPBE
basis: SDD
operation: Freq
keyword: #p
keyword: freq=noraman
keyword: PBEPBE/SDD
title: #p freq=noraman PBEPBE/SDD
converged: YES YES NO NO
title: Mulliken charges:
elementType: O N N C C C C C C C H H H H H H H H H H H H H H H H H H
charge: -0.439835 -0.097938 -0.077781 -0.373618 -0.347447 -0.378782 -0.636025 -0.305519 -0.620752 -0.612011 0.209923 0.210585 0.192194 0.209907 0.174951 0.225976 0.229288 0.195107 0.222497 0.232514 0.187154 0.220567 0.229983 0.186781 0.220180 0.187984 0.224815 0.329300
chargesum: 0.00000
title: Mulliken charges with hydrogens summed into heavy atoms:
elementType: O N N C C C C C C C
charge: -0.110535 -0.097938 -0.077781 0.046890 0.054654 0.022145 0.010868 0.114149 0.016579 0.020969
polarizability: 1.12484213e+02 -3.57105380e-01 9.24502042e+01 2.41696869e+00 -1.97766226e+00 8.16290129e+01
1716.lowfreq: -13.5915 -0.0008 -0.0003 0.0005 7.7397 12.1117 33.6621 41.7577 81.9370
frequency: 33.5148 41.6235 81.9140 97.7804 102.2396 150.6091 182.2846 221.8000 233.2081 238.0431 279.1237 295.0846 312.0184 330.0045 360.3149 408.4680 431.6169 464.0812 511.1689 781.2786 803.0910 809.7702 853.8454 956.3466 1014.6170 1023.6537 1032.3088 1038.4973 1048.8092 1059.5940 1079.8958 1093.3220 1108.6857 1119.0576 1144.5000 1161.1680 1226.3435 1228.6197 1258.7225 1274.3020 1286.8721 1299.9410 1306.7011 1337.4206 1347.3270 1377.8731 1382.8458 1418.3480 1434.1152 1440.8791 1458.0550 1462.5187 1465.8167 1469.6746 1473.6829 1475.7555 1477.4869 1482.6591 1483.0080 1486.4570 2820.7547 2842.3585 2849.4921 2866.4057 2867.0599 2900.2195 2962.2396 3016.2228 3016.5019 3023.8047 3026.3658 3037.8883 3042.2110 3074.7376 3079.5943 3082.0271 3102.8653 3555.9170
redmass: 2.7604 3.9665 2.3424 2.3610 2.1486 2.3272 1.8945 1.1591 1.2497 1.1879 2.4471 2.5054 1.6114 1.8201 2.3531 2.9102 2.3634 2.6778 3.1577 1.2615 1.1739 3.9696 3.6759 4.1957 2.5034 2.2881 1.5313 2.0271 1.5071 2.5560 2.1293 1.4442 1.3031 1.5379 1.5698 1.4943 2.2020 2.0242 2.2677 1.6809 1.1666 1.2858 1.3526 1.4259 1.2525 1.3610 1.3292 1.1430 1.1496 1.1602 1.0762 1.0540 1.0804 1.0536 1.0676 1.0697 1.0592 1.0631 1.0706 1.0686 1.0707 1.0574 1.0637 1.0628 1.0575 1.0682 1.0698 1.0729 1.0840 1.0736 1.0735 1.0898 1.0895 1.1009 1.1007 1.1004 1.0960 1.0660
irintensity: 1.2175 1.0613 2.1603 2.7245 1.9670 3.1189 0.3949 1.0078 0.3570 3.0781 11.6931 28.7754 54.2885 33.4081 41.4694 15.3083 2.2480 5.3194 5.2254 5.5443 5.2431 18.9694 4.6188 111.4927 7.0148 82.9785 9.3307 39.1118 9.9728 17.6017 4.0652 3.3060 5.2418 10.8052 3.1242 28.1540 3.3098 9.7405 13.1341 5.6990 10.4250 0.4154 19.4336 1.6086 33.0445 1.0467 0.3332 2.9764 3.7282 2.1177 5.7414 16.3260 1.5753 5.9642 7.6449 10.8042 23.1439 11.8745 3.8733 18.0040 112.7988 75.7483 72.2476 252.2817 41.2562 125.1879 67.4293 44.8348 4.2381 53.2638 29.7910 20.8689 67.9935 36.7326 35.7411 53.5661 29.1823 6.6546
temp: 298.150 k
press: 1.00000 atm
elementType: 8 7 7 6 6 6 6 6 6 6 1 1 1 1 1 1 1 1 1 1 1 1 1 1 1 1 1 1
symmnumber: 1
zpe: 654509.4 jmol-1
zpe.correction: 0.249289 hartree
zpe.thermalcorrener: 0.262795 hartree
zpe.thermalcorrenthalpy: 0.263739 hartree
zpe.thermalcorrgfe: 0.208636 hartree
zpe.sumelectzpe: -461.343313 hartree
zpe.sumelectthermal: -461.329808 hartree
zpe.sumelectthermalent: -461.328864 hartree
zpe.sumelectthermalfe: -461.383967 hartree
dipole: -1.5688 0.2574 1.3154
dipole: 2.0634
quadrupole: -72.3053 -62.0381 -65.0108
quadrupole: 5.1974 8.7968 -3.9717
quadrupole: -5.8539 4.4133 1.4406 5.1974 8.7968 -3.9717
hfenergy: -461.5926023 hartree
pointgroup: C01 [X(C7H18N2O1)]
dipole: 0.6109172 0.0071254 -0.5345554 debye
polarizability: 112.5626683|-0.217717|92.7541698|1.9489784|0.4495062|81.2465915 unknown
InChI: InChI=1S/C7H18N2O/c1-8(2)4-5-9(3)6-7-10/h10H,4-7H2,1-3H3
charge 0 multiplicity 1
28 atoms
O  -3.925341 -1.277228 0.490326
N  -0.940141 1.013055 -0.050711
N  2.632756 -0.321777 -0.206972
C  0.188472 0.194175 -0.560879
C  1.404906 0.256482 0.390576
C  -2.277178 0.428469 -0.283472
C  -0.840269 2.43324 -0.441652
C  -2.590802 -0.69985 0.72212
C  2.538144 -1.778253 -0.434376
C  3.840861 0.028768 0.567501
H  0.518832 0.526504 -1.574086
H  -0.155347 -0.851649 -0.660964
H  1.127123 -0.236351 1.357427
H  1.613969 1.317644 0.623087
H  -2.399099 0.037635 -1.329533
H  -3.040616 1.217151 -0.152637
H  -1.607977 3.024811 0.087865
H  -0.964997 2.598989 -1.541119
H  0.147832 2.834405 -0.154497
H  -2.629185 -0.289587 1.742649
H  -1.80809 -1.48742 0.691242
H  3.472954 -2.139146 -0.899694
H  1.711215 -2.008267 -1.127889
H  2.373933 -2.36176 0.508699
H  4.740022 -0.343769 0.043913
H  3.845867 -0.396562 1.603992
H  3.925043 1.127197 0.649748
H  -3.959485 -1.643405 -0.429863
