program: Gaussian 09
title: 000075352
version: EM64L-G09RevD.01
frameworkgroup: C1[X(C24H20NP)]
method: RPBEPBE
basis: SDD
operation: Freq
keyword: #p
keyword: freq=noraman
keyword: PBEPBE/SDD
title: #p freq=noraman PBEPBE/SDD
converged: YES YES NO NO
title: Mulliken charges:
elementType: P N C C C C C C C C C C C C C C C C C C C C C C C C H H H H H H H H H H H H H H H H H H H H
charge: 0.834637 -0.555462 -0.102081 -0.017772 -0.018917 -0.251982 -0.306484 -0.280894 -0.272525 -0.293987 -0.305601 0.233015 -0.241676 -0.221771 -0.227308 -0.222671 -0.243101 -0.243408 -0.228612 -0.228887 -0.228186 -0.384419 -0.278609 -0.203149 -0.247282 -0.276220 0.233797 0.291502 0.265111 0.314440 0.248311 0.263740 0.231575 0.237112 0.235166 0.233067 0.233457 0.235258 0.231468 0.233702 0.234577 0.235468 0.208380 0.215312 0.213022 0.218887
chargesum: 0.00000
title: Mulliken charges with hydrogens summed into heavy atoms:
elementType: P N C C C C C C C C C C C C C C C C C C C C C C C C
charge: 0.834637 -0.555462 -0.102081 -0.017772 -0.018917 -0.018185 -0.014982 -0.015783 0.041915 -0.045676 -0.041861 0.233015 -0.010101 0.015340 0.007858 0.010396 -0.009644 -0.008149 0.002857 0.004815 0.006391 -0.148951 -0.070230 0.012163 -0.034260 -0.057333
chargesum: -0.00008
polarizability: 3.50368056e+02 -1.55919698e+01 2.50573377e+02 1.01643780e+01 -5.98314632e+00 2.99075574e+02
1716.lowfreq: -10.0286 -5.5765 -1.0017 -0.1121 -0.1110 7.5001 26.4719 30.5285 40.2163
frequency: 26.0965 30.5270 40.2081 42.4244 48.7874 57.0049 59.0686 71.9675 76.2719 137.8291 152.6367 178.7948 202.2005 226.6661 228.1379 230.5194 266.3652 271.0329 280.0917 394.0884 401.4355 402.3603 410.8871 418.8178 436.7142 448.4774 490.9490 506.6702 512.6190 518.6807 565.7449 610.4722 611.3813 612.4608 614.5304 659.6115 682.1470 688.5563 694.2338 699.9380 700.9487 705.2054 715.2577 754.2657 755.9496 757.3955 763.8660 813.2717 854.9066 860.2669 866.1196 875.9018 921.3184 931.3725 934.0320 941.1993 952.5020 972.6198 977.6317 981.8306 985.3615 986.8296 988.2089 989.0365 990.1141 1001.7829 1004.3025 1014.6503 1018.2698 1018.5908 1020.4605 1021.8946 1071.7253 1074.7712 1075.4520 1078.7694 1081.4047 1083.3440 1090.4331 1162.0900 1172.0142 1175.0028 1175.1847 1179.1603 1184.2413 1191.7429 1194.2251 1273.6146 1303.6217 1307.4853 1312.7178 1316.5918 1368.0767 1374.4308 1377.8200 1381.7327 1423.0010 1427.1184 1427.9717 1439.1243 1464.1179 1465.8824 1466.8589 1468.2474 1564.2824 1582.5009 1586.4465 1587.7417 1592.8728 1593.1063 1595.9433 1602.1754 3110.7850 3118.6856 3123.6950 3125.5115 3126.5852 3131.3245 3132.1857 3133.3444 3133.7935 3141.1527 3142.0383 3143.9011 3147.3818 3151.6821 3152.1586 3153.4163 3161.3855 3165.4681 3166.4903 3166.9414
redmass: 4.2001 4.4618 4.9100 5.0691 4.2871 4.7795 4.0832 4.6333 4.2412 5.2105 5.3761 4.6989 4.7179 4.9012 5.8566 5.3401 5.2789 4.8769 5.9286 2.7694 2.8374 2.8527 2.9179 5.8343 5.7247 5.2574 4.6320 3.2263 4.8680 4.2111 7.9108 6.5004 6.4619 6.4559 6.4913 6.7243 5.5694 1.8507 6.0999 2.0375 2.1486 2.1441 5.3741 1.6708 1.7032 1.7311 1.6290 1.2674 1.2530 1.2468 1.2417 1.5192 5.0851 1.5026 1.3679 1.3662 1.3564 1.2987 4.3030 1.5462 1.6200 4.1729 5.4593 2.1610 2.1989 1.3219 1.3209 1.3410 3.2638 3.2888 2.7703 2.1282 1.7038 2.1362 1.7769 1.9926 1.8702 1.6753 2.5311 1.0521 1.0625 1.0550 1.0552 1.1100 1.1242 1.1268 1.1282 3.6925 1.3894 1.4415 1.3453 1.3180 4.5574 7.2238 8.3124 9.0688 2.1021 2.1254 2.1266 2.7139 2.0568 2.0244 2.1709 2.1695 5.8980 5.8293 6.0876 6.1494 5.7951 5.8151 5.8842 6.1759 1.0839 1.0866 1.0857 1.0851 1.0850 1.0874 1.0879 1.0920 1.0888 1.0920 1.0919 1.0920 1.0942 1.0963 1.0963 1.0960 1.1007 1.1015 1.1015 1.1015
irintensity: 0.0497 0.0341 0.2851 0.0593 0.1154 0.1518 0.2283 0.3147 0.2423 4.2785 1.1409 2.1622 1.9428 4.5515 1.4327 1.0061 4.2102 1.5268 2.6982 0.0173 0.4066 0.1167 0.1263 11.6252 4.7308 11.0664 20.1682 5.1274 55.9115 99.1219 42.6963 1.5515 0.0537 0.5669 1.9780 0.1180 8.4885 47.5808 5.5130 43.5685 39.2578 69.2078 39.1983 17.7380 27.2316 53.0092 44.3071 0.2513 0.5698 0.2084 0.1727 6.3567 81.0263 11.8036 1.6889 0.8163 0.0624 0.4248 6.6167 2.2206 0.5842 1.5186 2.7835 0.2797 0.1785 0.0871 0.0093 1.2999 1.8337 2.6331 15.5389 12.5881 12.4219 33.8397 23.6429 15.7477 6.5161 6.4498 17.7157 0.9938 2.0059 0.2139 0.8915 17.4138 9.5885 11.7346 5.6884 287.1707 21.0266 63.9648 6.6457 5.6193 22.1346 0.5012 1.1021 2.2796 16.7404 25.0108 14.5413 0.3189 24.1319 20.5379 126.3877 62.6380 12.3360 0.5175 3.6797 0.3781 0.9180 2.4988 7.9870 141.8881 20.6700 5.1775 3.7626 1.1280 0.6933 1.3365 6.8391 25.1437 22.6131 10.3670 3.1359 11.2469 35.8577 22.6974 15.2230 19.7227 30.6033 45.7201 47.4836 15.3951
temp: 298.150 k
press: 1.00000 atm
elementType: 15 7 6 6 6 6 6 6 6 6 6 6 6 6 6 6 6 6 6 6 6 6 6 6 6 6 1 1 1 1 1 1 1 1 1 1 1 1 1 1 1 1 1 1 1 1
symmnumber: 1
zpe: 952249.8 jmol-1
zpe.correction: 0.362693 hartree
zpe.thermalcorrener: 0.385049 hartree
zpe.thermalcorrenthalpy: 0.385993 hartree
zpe.thermalcorrgfe: 0.308868 hartree
zpe.sumelectzpe: -1320.709244 hartree
zpe.sumelectthermal: -1320.686888 hartree
zpe.sumelectthermalent: -1320.685944 hartree
zpe.sumelectthermalfe: -1320.763069 hartree
dipole: -4.2030 0.0866 -3.4348
dipole: 5.4287
quadrupole: -154.8023 -148.1070 -143.2505
quadrupole: -4.9477 -5.7538 -0.9470
quadrupole: -6.0823 0.6129 5.4694 -4.9477 -5.7538 -0.9470
hfenergy: -1321.0719369 hartree
pointgroup: C01 [X(C24H20N1P1)]
dipole: 1.1781931 -0.0518315 1.7806879 debye
polarizability: 333.0247373|24.6687847|255.0541074|24.7921622|4.7720138|311.938162 unknown
InChI: InChI=1S/C24H20NP/c1-5-13-21(14-6-1)25-26(22-15-7-2-8-16-22,23-17-9-3-10-18-23)24-19-11-4-12-20-24/h1-20H
charge 0 multiplicity 1
46 atoms
P  0.33619 0.061751 -0.105678
N  -0.374954 0.11897 -1.63718
C  2.138219 0.356097 -0.47856
C  0.214445 -1.607118 0.771904
C  -0.133822 1.35483 1.183679
C  3.082568 0.502599 0.56455
C  -0.285419 -2.69142 0.013348
C  0.365123 2.671195 1.020843
C  2.544931 0.404791 -1.830731
C  0.658849 -1.807797 2.100766
C  -1.059617 1.074391 2.218176
C  -1.762931 0.026814 -1.874787
C  4.445949 0.6984 0.248837
C  -0.345816 -3.980185 0.589229
C  -0.044362 3.695471 1.901987
C  3.909436 0.600502 -2.139568
C  0.600545 -3.099905 2.670372
C  -1.465966 2.10201 3.098459
C  4.861238 0.744916 -1.10257
C  0.098109 -4.186308 1.916123
C  -0.959395 3.412792 2.943258
C  -2.173222 0.161058 -3.239943
C  -2.786124 -0.196921 -0.898577
C  -3.529391 0.067491 -3.604601
C  -4.143932 -0.285173 -1.273449
C  -4.531543 -0.156405 -2.626884
H  2.766548 0.482021 1.613994
H  -0.618144 -2.519487 -1.016662
H  1.066718 2.894871 0.209214
H  1.775986 0.297664 -2.603359
H  1.039497 -0.969824 2.695889
H  -1.45959 0.062178 2.346854
H  5.179103 0.81477 1.054452
H  -0.738211 -4.818987 0.004296
H  0.346172 4.710842 1.773682
H  4.228747 0.640054 -3.186797
H  0.946029 -3.257715 3.698092
H  -2.18105 1.880102 3.898213
H  5.919344 0.895199 -1.345107
H  0.052895 -5.186905 2.360505
H  -1.278229 4.208967 3.625078
H  -1.397327 0.339426 -3.992132
H  -2.514603 -0.302669 0.158984
H  -3.809711 0.173976 -4.659771
H  -4.903466 -0.455879 -0.500495
H  -5.586215 -0.22515 -2.914537
