program: Gaussian 09
title: 000075175
version: EM64L-G09RevD.01
frameworkgroup: C1[X(C15H24O2)]
method: RPBEPBE
basis: SDD
operation: Freq
keyword: #pfreq=noraman
keyword: PBEPBE/SDD
title: #p freq=noraman PBEPBE/SDD
converged: YES YES NO NO
title: Mulliken charges:
elementType: O O C C C C C C C C C C C C C C C H H H H H H H H H H H H H H H H H H H H H H H H
charge: -0.464503 -0.506268 0.145989 -0.397142 0.291625 0.403677 -0.745152 -0.774265 -0.725258 -0.722884 -0.715880 -0.593990 -0.020543 0.510272 0.172235 -0.584835 -0.826445 0.173484 0.232168 0.266519 0.210965 0.201819 0.213459 0.213467 0.226948 0.213153 0.207266 0.208019 0.207906 0.203458 0.208337 0.196454 0.217307 0.232515 0.255696 0.226947 0.233152 0.217856 0.227185 0.385314 0.373972
chargesum: 0.00000
title: Mulliken charges with hydrogens summed into heavy atoms:
elementType: O O C C C C C C C C C C C C C C C
charge: -0.079189 -0.132296 0.145989 0.008511 0.291625 0.403677 -0.065849 -0.120391 -0.096821 -0.103183 -0.069603 -0.338294 -0.020543 0.510272 0.172235 -0.357888 -0.148252
polarizability: 1.92019893e+02 -1.61893316e+00 1.74788866e+02 1.89267474e+01 -1.87620958e+00 1.39650704e+02
1716.lowfreq: -15.5137 -9.0383 -0.0008 -0.0008 -0.0004 6.5744 15.9420 23.8958 47.2450
frequency: 6.9139 22.4835 47.1688 63.0693 122.3399 168.5057 175.6185 181.8962 215.1201 222.1237 232.8311 244.8833 246.7859 248.2924 260.2531 275.6822 290.2181 291.5032 318.0842 326.1159 346.0405 347.9211 365.0990 379.0804 391.8089 413.8273 441.5567 455.0160 502.3178 504.4576 513.7905 552.9868 579.4802 605.7906 616.3362 732.4745 744.2596 756.8413 805.3394 819.1413 864.0618 877.4053 889.8699 917.7870 923.9044 927.1614 939.6217 946.8424 958.9502 979.1324 1004.7761 1008.4104 1024.2095 1033.4982 1044.1117 1089.6707 1122.1662 1140.8093 1155.2912 1185.4881 1197.2592 1216.2227 1221.3661 1249.9732 1253.4223 1287.6132 1326.7506 1337.0333 1348.7962 1368.8838 1372.3109 1376.1619 1395.9877 1397.7760 1400.1403 1402.3124 1419.2060 1449.7126 1455.7322 1462.6315 1464.5665 1467.9322 1471.9776 1476.4301 1478.8574 1480.7798 1484.8853 1490.5112 1496.7085 1505.6725 1511.0933 1603.9376 1625.7428 2951.1639 2961.1189 2966.4785 2971.8776 2972.6297 2975.0841 2981.9001 3037.9795 3051.6100 3053.9471 3056.7271 3059.2559 3061.2421 3065.3069 3068.0163 3074.2752 3079.2500 3086.6745 3102.1743 3106.6185 3115.0577 3152.6820 3495.1490 3630.5393
redmass: 2.7924 1.0433 3.6485 4.3863 3.9729 2.5130 3.2998 3.3460 1.0873 3.8579 2.6090 1.1047 1.0950 1.9642 1.4803 2.0515 2.1348 1.2169 3.2446 1.9481 2.2950 2.7726 2.4163 3.3090 2.1412 1.8406 2.4610 5.1059 1.2466 2.8453 2.7712 3.2853 3.3523 4.4193 3.8108 3.6057 4.3040 5.3079 3.6364 1.4330 1.9338 1.9097 1.7351 1.7546 1.7531 1.6687 1.2479 1.7127 4.4493 1.7713 1.3623 1.4212 1.4051 1.4218 1.5176 2.0460 2.1658 1.6314 1.5343 2.2073 2.0128 2.5359 2.4047 2.4296 3.1318 1.8962 1.8892 2.0670 1.2912 1.2034 1.2097 1.2003 1.3871 1.2392 1.2403 2.5126 3.5488 1.0764 1.0534 1.0517 1.0710 1.0591 1.0559 1.0643 1.1031 1.0798 1.0627 1.0556 1.0600 1.9172 1.2946 6.5582 6.7170 1.0642 1.0348 1.0354 1.0382 1.0371 1.0366 1.0380 1.0950 1.0957 1.0993 1.0993 1.0996 1.0992 1.0982 1.0983 1.0991 1.0994 1.0986 1.0961 1.0983 1.0918 1.0901 1.0645 1.0666
irintensity: 0.1080 0.4928 0.6221 0.8254 0.9671 1.0600 3.5845 2.2659 0.1388 0.0265 0.7835 8.3488 149.4131 9.9876 0.0438 2.6088 2.7807 0.7026 2.8380 2.4400 1.7703 1.6485 1.1247 1.2123 0.7528 1.0614 1.7299 1.2414 90.6828 12.3312 3.3632 0.8931 9.2284 15.7732 4.7763 0.5909 5.3789 12.2520 6.1735 31.5722 10.3379 12.5032 14.8003 5.2106 9.9319 0.4614 2.5891 20.6619 35.4342 11.8758 6.8625 13.2507 0.1763 0.3041 15.2371 94.2273 11.5665 15.2259 22.1744 13.1049 71.5577 73.3977 39.5047 15.0902 15.8182 106.5801 27.1153 20.8689 5.9767 8.9761 12.4243 31.8352 14.1659 3.7017 21.1014 31.3297 27.1226 2.1483 1.1349 4.6709 2.7740 8.1820 13.2944 18.6650 19.4713 12.5622 5.6385 13.9044 25.1427 34.0989 5.7079 29.4541 9.5449 39.1784 46.4395 35.8379 44.5170 39.9579 27.1498 47.3069 3.7973 22.0562 17.9486 9.7733 36.7133 4.5512 122.7479 62.7757 53.9165 19.5423 38.9730 30.9881 11.3344 17.8104 7.2511 76.8683 49.6670
temp: 298.150 k
press: 1.00000 atm
elementType: 8 8 6 6 6 6 6 6 6 6 6 6 6 6 6 6 6 1 1 1 1 1 1 1 1 1 1 1 1 1 1 1 1 1 1 1 1 1 1 1 1
symmnumber: 1
zpe: 929748.2 jmol-1
zpe.correction: 0.354122 hartree
zpe.thermalcorrener: 0.373890 hartree
zpe.thermalcorrenthalpy: 0.374834 hartree
zpe.thermalcorrgfe: 0.305818 hartree
zpe.sumelectzpe: -735.100765 hartree
zpe.sumelectthermal: -735.080998 hartree
zpe.sumelectthermalent: -735.080054 hartree
zpe.sumelectthermalfe: -735.149069 hartree
dipole: -2.6352 -0.0370 -1.1452
dipole: 2.8735
quadrupole: -92.9721 -100.2222 -107.9683
quadrupole: 5.3850 6.0654 2.0480
quadrupole: 7.4155 0.1653 -7.5808 5.3850 6.0654 2.0480
hfenergy: -735.4548877 hartree
pointgroup: C01 [X(C15H24O2)]
dipole: 1.035654 -0.0184916 -0.452917 debye
polarizability: 191.8318779|-2.3322258|174.9447724|-18.9713687|1.8298568|139.6828129 unknown
InChI: InChI=1S/C15H24O2/c1-10-7-11(13(17)12(16)8-10)15(5,6)9-14(2,3)4/h7-8,16-17H,9H2,1-6H3
charge 0 multiplicity 1
41 atoms
O  0.32647 2.177369 0.752152
O  2.698326 2.451185 -0.356826
C  -0.978135 -0.447832 1.271681
C  -2.142354 0.342542 0.557579
C  -2.557442 0.149856 -0.944716
C  0.391899 -0.288262 0.57213
C  -0.854177 0.165718 2.708587
C  -1.360215 -1.939168 1.477843
C  -3.816543 1.046467 -1.145599
C  -2.948314 -1.307979 -1.31006
C  -1.460972 0.63666 -1.931112
C  1.152686 -1.408474 0.140297
C  0.982185 0.988754 0.375002
C  2.427451 -1.303748 -0.470207
C  2.256496 1.106918 -0.231046
C  2.986704 -0.016015 -0.653995
C  3.170275 -2.545654 -0.935649
H  -3.047794 0.140091 1.17035
H  -1.916482 1.418319 0.681612
H  -0.59305 1.234908 2.664261
H  -0.075249 -0.364023 3.287906
H  -1.81597 0.060175 3.246105
H  -0.630229 -2.446157 2.136933
H  -2.347534 -1.990927 1.972543
H  -1.429578 -2.510775 0.539046
H  -3.597805 2.100904 -0.890755
H  -4.654721 0.708715 -0.506164
H  -4.156128 1.013504 -2.19846
H  -3.654452 -1.736809 -0.574214
H  -3.438282 -1.329326 -2.302946
H  -2.063521 -1.966649 -1.367585
H  -1.852567 0.628743 -2.967121
H  -1.142681 1.668002 -1.691271
H  -0.568229 -0.01062 -1.90075
H  0.737863 -2.41055 0.282844
H  3.974031 0.101238 -1.119608
H  2.787704 -2.903361 -1.911579
H  4.250742 -2.352034 -1.056687
H  3.054873 -3.376568 -0.216598
H  0.923683 2.938882 0.520612
H  3.586337 2.508082 -0.781636
