program: Gaussian 09
title: 000075111
version: EM64L-G09RevD.01
frameworkgroup: C1[X(C9H11NO)]
method: RPBEPBE
basis: SDD
operation: Freq
keyword: #p
keyword: freq=noraman
keyword: PBEPBE/SDD
title: #p freq=noraman PBEPBE/SDD
converged: YES YES NO NO
title: Mulliken charges:
elementType: O N C C C C C C C C C H H H H H H H H H H H
charge: -0.279265 -0.382474 0.163527 0.316205 -0.381146 -0.408519 0.148472 -0.792748 -0.246507 -0.222416 -0.610485 0.245336 0.233951 0.229760 0.209818 0.270409 0.230619 0.229474 0.317606 0.225174 0.226081 0.277131
chargesum: 0.00000
title: Mulliken charges with hydrogens summed into heavy atoms:
elementType: O N C C C C C C C C C
charge: -0.279265 -0.064868 0.163527 0.316205 -0.135810 -0.174568 0.148472 -0.082762 -0.015888 0.007058 0.117900
polarizability: 1.40411371e+02 1.10768745e+00 1.16157669e+02 6.47230295e-01 6.24935583e-02 5.92024723e+01
1716.lowfreq: -10.5140 -4.4957 -0.0003 0.0000 0.0006 10.8833 57.7107 96.7065 110.4631
frequency: 57.6944 96.6817 110.4506 117.9703 136.2887 195.2845 241.7716 290.2205 324.5820 373.1476 411.2245 466.3931 523.7584 554.8271 581.2091 652.2629 696.6677 742.2477 772.1129 784.0146 819.3390 878.0029 951.4023 986.0403 991.4266 993.5806 1047.5497 1049.3526 1114.4563 1121.6963 1135.0522 1157.7657 1176.1691 1211.4273 1263.3918 1283.1142 1371.1954 1403.6584 1414.9572 1425.2524 1450.8387 1453.7440 1472.6863 1479.7218 1488.4630 1511.9031 1577.0942 1597.3394 1613.4607 2976.8530 2990.4406 3055.6261 3075.2950 3094.2127 3107.2699 3119.0747 3125.3020 3141.4034 3161.9186 3560.5600
redmass: 4.6529 1.7560 1.4912 1.1109 2.9034 3.0939 4.0155 4.1735 3.7901 5.3180 3.1826 2.9896 4.1861 4.8796 1.1261 5.8843 5.0128 1.6242 4.3716 2.2943 4.0882 1.3097 1.4237 2.7976 1.3643 1.8930 1.5872 2.1723 1.9502 1.3312 1.6957 2.2515 1.0644 2.5484 2.4079 1.4596 7.8380 1.2351 1.2792 1.7213 1.3940 1.0772 1.2705 1.8774 1.0463 1.4679 6.5339 6.1673 6.5778 1.0348 1.0368 1.1024 1.0966 1.1004 1.0980 1.0859 1.0889 1.0937 1.1009 1.0776
irintensity: 8.0305 0.9162 0.9902 0.4175 0.9876 4.2738 3.5757 4.3188 9.0683 5.1645 5.9204 9.3450 3.3875 2.0035 111.3452 6.4610 9.8598 50.3639 0.2160 25.9466 1.3749 0.5739 3.4625 20.0297 0.3571 2.6745 11.3970 6.2722 4.8295 0.2378 56.3077 3.0920 0.4027 4.1667 95.2486 7.5443 1.6411 25.0036 31.1725 4.2555 114.6797 15.0807 31.5455 3.1189 14.3332 130.8147 31.4113 66.8268 67.0578 81.8075 22.4724 36.8824 17.7319 16.8552 1.8242 7.5701 3.6902 31.1127 27.7281 17.2269
temp: 298.150 k
press: 1.00000 atm
elementType: 8 7 6 6 6 6 6 6 6 6 6 1 1 1 1 1 1 1 1 1 1 1
symmnumber: 1
zpe: 472386.4 jmol-1
zpe.correction: 0.179922 hartree
zpe.thermalcorrener: 0.190822 hartree
zpe.thermalcorrenthalpy: 0.191766 hartree
zpe.thermalcorrgfe: 0.143121 hartree
zpe.sumelectzpe: -478.739905 hartree
zpe.sumelectthermal: -478.729005 hartree
zpe.sumelectthermalent: -478.728061 hartree
zpe.sumelectthermalfe: -478.776706 hartree
dipole: -0.3681 -2.7339 -2.2123
dipole: 3.5361
quadrupole: -56.0984 -60.7413 -69.3760
quadrupole: -6.4503 -3.9634 -2.0182
quadrupole: 5.9735 1.3306 -7.3040 -6.4503 -3.9634 -2.0182
hfenergy: -478.9198274 hartree
pointgroup: C01[X(C9H11N1O1)]
dipole: -0.2539885 0.738412 1.1513777 debye
dipolederiv: -0.7703288 0.1328355 0.1875537 -0.0058934 -0.5919919 -0.2986086 -0.0781387 -0.2912263 -0.7378817 -0.8732845 -0.2430968 -0.32597 -0.2303069 -0.5905062 -0.1313755 -0.3345219 -0.1265271 -0.5885256 -0.3169985 -0.016419 0.0122954 0.0986223 -0.1147199 -0.052977 0.0497022 -0.0410664 -0.0782887 0.0233331 -0.2115999 -0.0467434 -0.073435 0.3361875 0.0650138 0.0288812 0.0946858 0.007535 0.0209591 0.0550302 -0.0202224 -0.0539952 0.0019143 0.0072349 -0.1307225 -0.0006051 -0.1510037 -0.0470974 0.2446319 0.0341019 0.1144757 -0.0653201 0.0101883 -0.0008688 0.0018658 -0.1705447 1.3563274 0.0913099 0.1155398 0.2386542 0.6392318 0.6235632 0.3956479 0.5772065 0.96139 0.021321 0.1936181 0.0400173 0.1107939 -0.1062381 -0.0519012 0.0443844 -0.0889471 -0.0029386 -0.1451759 -0.0922251 -0.0213995 -0.0891793 0.0348487 0.0334178 -0.0130719 0.0363228 -0.1602973 0.1178757 -0.0129045 -0.0218678 0.028651 0.0342371 0.0309766 -0.0072153 0.028811 -0.1324796 0.4967124 0.1188527 0.1374236 -0.0660855 0.1660645 -0.1335297 -0.0317327 -0.1322436 0.0851492 0.0148692 -0.1116905 -0.0039476 -0.0980306 -0.0281728 -0.0183997 0.006895 -0.0237956 0.1363102 0.0074867 -0.0805518 -0.0081594 -0.11895 -0.0577235 -0.0279837 -0.01156 -0.0266621 0.1470134 0.0068788 0.0626045 -0.1077618 0.0410534 0.0328533 0.0021927 -0.1119921 0.0514093 -0.0019301 -0.0730258 -0.1894959 -0.0062776 -0.0725433 -0.0463316 -0.0060698 0.0145522 0.0231235 0.1112752 0.1144574 0.0329419 0.0776918 0.0259478 0.0703555 0.0124028 0.0614639 -0.0270599 -0.0211501 0.0393299 0.0674637 0.0172841 0.0874058 -0.0885888 -0.0434375 0.0269538 -0.0400775 0.1554688 -0.1319945 0.0308882 0.0219083 0.0231441 0.0855635 -0.0114989 0.0219993 -0.0152784 0.1528799 0.1206132 0.0234947 0.0442776 0.0406324 0.2591556 -0.085921 0.0891511 -0.0778254 0.2070991 -0.059839 -0.0169866 -0.0888018 0.0464795 0.0739071 0.1018638 -0.1360413 0.0868476 -0.0883946 -0.0648086 -0.0777852 -0.0364555 -0.1436728 -0.1353301 0.0315697 0.0006286 0.0396975 0.1172057 0.1423891 -0.000916 -0.0004869 0.0962318 0.090604 -0.0567208 0.1156058 -0.0486552 0.0521082 unknown
polarizability: 140.415915|0.6981202|110.6647305|1.1249731|16.7997552|64.6908664 unknown
InChI: InChI=1S/C9H11NO/c1-7-5-3-4-6-8(7)9(11)10-2/h3-6,10H,1-2H3
charge 0 multiplicity 1
22 atoms
O  2.001399 -0.858771 -1.003695
N  2.1996 0.602227 0.799761
C  -0.045361 -0.002423 0.040631
C  -0.899957 -1.137792 -0.117809
C  -0.606531 1.278601 0.290348
C  -2.298232 -0.939686 0.008986
C  1.451908 -0.136305 -0.112443
C  -0.359559 -2.526935 -0.403953
C  -2.002102 1.454609 0.401128
C  -2.851827 0.335031 0.264327
C  3.665543 0.627346 0.771399
H  0.052486 2.152653 0.357852
H  -2.962875 -1.805109 -0.098137
H  0.422056 -2.819883 0.320384
H  -1.169506 -3.275645 -0.366825
H  0.122165 -2.561713 -1.396051
H  -2.419308 2.451242 0.581242
H  -3.938019 0.452578 0.348753
H  1.70698 1.086069 1.551534
H  4.094191 0.207829 1.700541
H  4.048616 1.655435 0.632122
H  3.987335 0.005944 -0.079895
