program: Gaussian 09
title: 000075101
version: EM64L-G09RevD.01
frameworkgroup: C1[X(C10H20Cl2)]
method: RPBEPBE
basis: SDD
operation: Freq
keyword: #p
keyword: freq=noraman
keyword: PBEPBE/SDD
title: #p freq=noraman PBEPBE/SDD
converged: YES YES NO NO
title: Mulliken charges:
elementType: Cl Cl C C C C C C C C C C H H H H H H H H H H H H H H H H H H H H
charge: -0.084830 -0.090267 -0.382491 -0.384309 -0.378496 -0.370777 -0.375338 -0.346348 -0.316573 -0.349829 -0.602992 -0.591488 0.195154 0.193088 0.199041 0.193888 0.197210 0.198836 0.195181 0.188146 0.196139 0.195456 0.187582 0.218655 0.220686 0.221227 0.229733 0.204060 0.259631 0.259254 0.255490 0.265281
chargesum: 0.00000
title: Mulliken charges with hydrogens summed into heavy atoms:
elementType: Cl Cl C C C C C C C C C C
charge: -0.084830 -0.090267 0.005751 0.008620 0.017550 0.012549 0.016257 0.059889 0.125340 0.083964 -0.084106 -0.070717
polarizability: 1.68656354e+02 -3.60304782e+00 1.14234100e+02 3.11879658e+00 7.78207961e-01 9.81120521e+01
1716.lowfreq: -0.0016 0.0017 0.0025 1.6309 6.6132 15.7210 24.7308 35.9781 39.8218
frequency: 23.6059 35.7066 37.4735 57.0249 76.9387 85.4793 105.3497 118.3232 126.0755 151.1190 151.4792 180.2223 198.7110 253.0883 317.0651 345.1731 419.5861 466.3565 499.4553 595.3219 676.6972 722.9872 729.5678 745.1621 768.1360 804.9321 845.7316 877.0187 935.8600 975.6792 991.4169 1001.2712 1015.6265 1040.2920 1057.7787 1065.6209 1073.2553 1077.8383 1081.7256 1092.1988 1111.8090 1172.6496 1194.9833 1212.3359 1227.2386 1243.7507 1256.5937 1271.2518 1276.4284 1283.0043 1288.5372 1295.4825 1298.7147 1299.3457 1307.1585 1327.5946 1346.3175 1355.1518 1358.9812 1367.4787 1445.4789 1451.3460 1456.5074 1461.3127 1462.0591 1465.9489 1469.0468 1476.4183 1483.9523 1488.5070 2950.0678 2951.6065 2954.6141 2955.9903 2959.0862 2965.7186 2968.5036 2985.7401 2993.1593 2996.3147 3002.9799 3017.5095 3024.6628 3037.6752 3045.7195 3046.4245 3052.2249 3059.1548 3129.0691 3129.1311
redmass: 6.0399 4.6717 2.7043 3.5849 2.0206 3.5043 3.4426 1.8737 3.3854 2.3714 1.9312 3.4668 3.7345 2.8282 3.5875 4.1992 3.1649 3.4331 2.8695 4.2789 6.1622 1.0619 1.0849 1.1189 1.1686 1.2754 1.4538 1.3945 1.3831 2.5368 4.9153 1.6730 1.9377 3.2554 2.8128 1.5446 1.1989 1.9383 2.1449 3.0849 1.9705 1.4035 1.6071 1.2843 1.4070 1.2600 1.2975 1.2466 1.1759 1.0581 1.0954 1.1379 1.2235 1.1032 1.1465 1.3338 1.4469 1.5714 1.6381 1.6121 1.0793 1.1015 1.0970 1.0757 1.0712 1.0669 1.0860 1.0966 1.1001 1.1008 1.0592 1.0587 1.0638 1.0590 1.0596 1.0606 1.0619 1.0959 1.0978 1.0595 1.1006 1.0976 1.0988 1.1021 1.0782 1.0563 1.0844 1.1041 1.1111 1.1114
irintensity: 0.6281 0.0594 0.8224 1.0612 1.4730 1.2592 0.8512 0.3564 0.1675 0.1698 0.1214 2.6558 0.5429 3.2237 0.5236 1.9011 4.1697 3.6585 0.5789 21.9143 45.3314 15.7780 0.1746 12.2478 0.9555 7.1844 2.1777 2.8072 5.8140 5.9454 1.3154 1.1324 0.5238 2.1987 12.0610 1.6071 0.2337 1.0649 0.5572 1.8253 1.9963 14.1163 3.6056 7.6488 1.0898 4.2076 0.9221 5.4771 5.3043 2.1898 0.4598 8.1465 9.6382 0.7231 16.3115 6.4512 6.1337 0.3135 0.1275 1.2089 7.2802 6.7870 1.9931 0.2941 0.1601 0.2985 0.1595 2.8277 0.1348 32.4693 1.0786 0.4754 16.4841 11.7481 3.4777 22.7763 157.0921 3.8627 1.4302 25.2572 4.5767 4.3742 3.2422 50.1562 35.8082 30.1597 116.3750 76.0847 19.9383 30.0289
temp: 298.150 k
press: 1.00000 atm
elementType: 17 17 6 6 6 6 6 6 6 6 6 6 1 1 1 1 1 1 1 1 1 1 1 1 1 1 1 1 1 1 1 1
symmnumber: 1
zpe: 736918.1 jmol-1
zpe.correction: 0.280677 hartree
zpe.thermalcorrener: 0.296635 hartree
zpe.thermalcorrenthalpy: 0.297580 hartree
zpe.thermalcorrgfe: 0.233456 hartree
zpe.sumelectzpe: -1312.185251 hartree
zpe.sumelectthermal: -1312.169293 hartree
zpe.sumelectthermalent: -1312.168349 hartree
zpe.sumelectthermalfe: -1312.232472 hartree
dipole: -1.6423 3.2826 0.2599
dipole: 3.6797
quadrupole: -128.3393 -90.8340 -88.4794
quadrupole: -6.1436 -8.4246 0.6322
quadrupole: -25.7884 11.7169 14.0715 -6.1436 -8.4246 0.6322
hfenergy: -1312.4659283 hartree
pointgroup: C01 [X(C10H20Cl2)]
dipole: -0.6659541 1.2691194 0.2042078 debye
polarizability: 168.6282662|-3.2068379|113.8826055|3.9835236|2.1624553|98.4916347 unknown
InChI: InChI=1S/C10H20Cl2/c11-9-7-5-3-1-2-4-6-8-10-12/h1-10H2
charge 0 multiplicity 1
32 atoms
Cl 7.197734 -0.703548 0.192686
Cl -6.232439 -1.463811 -0.563049
C  0.55736 0.555302 -0.189812
C  -0.756765 -0.138266 0.23394
C  1.819479 -0.255275 0.18107
C  -2.019349 0.672788 -0.134149
C  3.134207 0.441553 -0.239602
C  -3.331768 -0.021345 0.292599
C  4.388126 -0.385146 0.142898
C  -4.585783 0.796908 -0.08239
C  5.673556 0.321614 -0.285516
C  -5.909683 0.170647 0.353887
H  0.542221 0.730082 -1.286074
H  0.612185 1.557754 0.284486
H  -0.813764 -1.139429 -0.241675
H  -0.74112 -0.315594 1.329797
H  1.833576 -0.432208 1.276597
H  1.766974 -1.255901 -0.295809
H  -2.036669 0.844788 -1.230864
H  -1.96006 1.676827 0.337127
H  3.121191 0.615587 -1.335661
H  3.186424 1.442117 0.237775
H  -3.318984 -0.193449 1.389425
H  -3.396873 -1.01998 -0.18198
H  4.406803 -0.551987 1.236793
H  4.339499 -1.381927 -0.335426
H  -4.607768 0.978731 -1.17441
H  -4.529907 1.79697 0.401747
H  5.74521 0.445438 -1.377405
H  5.812907 1.290665 0.218721
H  -5.919521 -0.100196 1.421615
H  -6.778498 0.799492 0.106857
