program: Gaussian 09
title: 000075149
version: EM64L-G09RevD.01
frameworkgroup: C1[X(C12H14O6)]
method: RPBEPBE
basis: SDD
operation: Freq
keyword: #pfreq=noraman
keyword: PBEPBE/SDD
title: #p freq=noraman PBEPBE/SDD
converged: YES YES NO NO
title: Mulliken charges:
elementType: O O O O O O C C C C C C C C C C C C H H H H H H H H H H H H H H
charge: -0.300497 -0.258510 -0.522605 -0.243311 -0.456802 -0.281729 -0.248793 -0.290678 0.202930 0.199725 -0.247013 0.148789 -0.374078 -0.338828 -0.329218 -0.220751 -0.218377 0.118837 0.205356 0.239044 0.230226 0.238399 0.264782 0.202957 0.265609 0.268624 0.248189 0.225292 0.236969 0.235724 0.376666 0.423072
chargesum: 0.00000
title: Mulliken charges with hydrogens summed into heavy atoms:
elementType: O O O O O O C C C C C C C C C C C C
charge: -0.300497 -0.258510 -0.145939 -0.243311 -0.033730 -0.281729 0.195607 0.177946 0.202930 0.199725 0.220725 0.148789 -0.108468 -0.070204 0.144264 0.016218 0.017347 0.118837
polarizability: 1.97451907e+02 -4.18371391e+00 1.66179608e+02 -7.47711778e+00 7.32766851e+00 8.83336382e+01
1716.lowfreq: -36.8478 -7.7436 -0.0003 0.0003 0.0007 5.7082 10.4804 39.5076 52.4763
frequency: -36.7215 39.3951 52.4467 82.2794 89.7494 117.1427 131.1846 137.6322 160.9836 163.1514 200.1973 229.8006 264.1146 282.2934 297.1179 328.7525 334.8037 376.0086 397.7401 403.6666 409.5671 430.5034 502.4586 527.8063 553.5620 631.7043 654.3722 670.3190 706.0712 735.7234 769.3484 779.2749 788.6793 796.3537 830.9048 857.4842 900.8011 944.3662 969.0015 972.6168 996.8732 1001.0806 1012.9866 1026.5212 1038.2831 1049.6111 1066.2021 1081.1583 1098.2526 1109.5907 1126.8980 1175.7199 1185.9250 1221.4737 1230.4629 1235.6489 1261.3392 1265.6671 1269.3731 1276.7299 1332.5224 1358.1150 1366.0519 1380.3174 1412.2891 1428.9015 1438.8047 1446.9447 1459.7675 1475.7007 1477.9742 1493.1590 1579.2899 1598.8319 1615.0864 1626.6882 2785.0961 2961.9067 2970.3479 3006.7721 3027.5298 3041.3855 3046.1208 3084.0331 3110.6889 3136.6671 3151.3315 3165.4251 3175.9122 3618.5020
redmass: 4.0005 8.1852 5.0570 4.8570 4.0582 4.3071 6.6846 4.1420 6.4328 4.1405 5.8117 8.4254 3.4335 2.7815 4.8760 1.4865 3.1237 3.9663 5.2046 4.3390 3.7126 3.3192 3.3887 4.4037 5.1948 6.6315 6.2187 6.1308 3.9289 4.5281 2.9421 2.2539 1.7460 4.3112 2.6033 3.1738 1.4642 3.9514 2.2881 1.5320 2.9898 1.3583 1.9884 2.5633 2.2595 2.0871 3.0993 2.9230 1.6498 2.9004 1.9278 1.0606 1.2200 1.1266 2.8944 1.3106 1.5930 1.2036 1.3285 1.5180 1.2155 1.2906 1.3371 10.8711 1.3157 2.1030 1.1160 1.3703 1.1479 1.2845 1.9920 1.0905 7.0947 5.9420 5.6756 10.6827 1.0731 1.0602 1.0599 1.0576 1.0615 1.1032 1.1000 1.1109 1.1057 1.0861 1.0908 1.0954 1.0994 1.0667
irintensity: 7.4046 0.6515 1.2277 2.3923 4.6637 11.6696 0.8654 3.3959 4.4041 0.7800 31.0877 7.0227 18.9143 14.2525 24.9771 149.6706 13.1522 6.2993 3.8858 8.4930 2.5077 1.4692 12.2721 2.2477 15.5509 8.3349 7.7594 3.1992 56.9630 3.2406 34.5948 0.1801 34.3680 0.4841 7.9820 20.5651 0.4573 78.4694 17.5082 3.4114 3.5931 2.0683 38.7075 44.5511 53.6510 183.5188 164.4831 138.9021 17.3696 26.8408 25.2728 0.9534 15.2142 19.4188 108.2964 107.9644 147.1877 23.0993 116.4442 31.0131 4.8277 14.4253 10.1417 9.6035 4.8096 9.4555 24.7323 6.5218 4.5826 13.4042 17.5581 38.1020 21.6327 119.2049 125.4971 175.9525 1525.8987 54.5098 106.5659 26.1796 22.9235 3.4869 34.6656 47.8441 7.1951 2.3017 8.9366 9.7304 16.3359 18.7873
temp: 298.150 k
press: 1.00000 atm
elementType: 8 8 8 8 8 8 6 6 6 6 6 6 6 6 6 6 6 6 1 1 1 1 1 1 1 1 1 1 1 1 1 1
symmnumber: 1
zpe: 646111.1 jmol-1
zpe.correction: 0.246091 hartree
zpe.thermalcorrener: 0.262560 hartree
zpe.thermalcorrenthalpy: 0.263504 hartree
zpe.thermalcorrgfe: 0.201908 hartree
zpe.sumelectzpe: -915.653539 hartree
zpe.sumelectthermal: -915.637070 hartree
zpe.sumelectthermalent: -915.636125 hartree
zpe.sumelectthermalfe: -915.697722 hartree
dipole: -2.0942 -3.1221 -2.3208
dipole: 4.4181
quadrupole: -78.8860 -94.0233 -111.3940
quadrupole: 3.2335 -1.7239 0.2992
quadrupole: 15.8817 0.7445 -16.6262 3.2335 -1.7239 0.2992
hfenergy: -915.8996298 hartree
pointgroup: C01 [X(C12H14O6)]
dipole: 0.8522413 1.1585735 -0.9760779 debye
polarizability: 197.0397303|-3.6433541|164.9029277|9.8558977|-12.5986964|90.0224954 unknown
InChI: InChI=1S/C12H14O6/c13-5-6-17-7-8-18-12(16)10-4-2-1-3-9(10)11(14)15/h1-4,13-14H,5-8H2
charge 0 multiplicity 1
32 atoms
O  3.292261 -1.152956 -0.426617
O  0.290708 -1.55632 -0.64513
O  3.178474 2.460868 -0.130916
O  -1.126422 -2.715866 0.814023
O  0.58134 2.272302 -0.237197
O  0.678308 0.541047 1.308788
C  2.491381 -2.10548 0.358932
C  1.335615 -2.609001 -0.504537
C  -1.775524 -0.519183 -0.041265
C  -1.328056 0.832974 -0.034247
C  3.646494 0.09538 0.26333
C  -0.858478 -1.693689 0.139898
C  -3.141294 -0.801076 -0.283039
C  -2.241236 1.872482 -0.332737
C  3.64134 1.205211 -0.79921
C  -4.051108 0.243051 -0.55684
C  -3.596838 1.581258 -0.59719
C  0.061944 1.176188 0.409458
H  3.132005 -2.968216 0.637607
H  2.096552 -1.633165 1.278167
H  0.878483 -3.512261 -0.061134
H  1.682062 -2.807918 -1.531148
H  2.88577 0.347561 1.025735
H  4.637392 -0.001207 0.750709
H  -3.474772 -1.843548 -0.264833
H  -1.877183 2.903944 -0.338392
H  2.921397 0.928019 -1.590495
H  4.637563 1.375644 -1.244599
H  -5.104833 0.012304 -0.745857
H  -4.296379 2.393848 -0.820415
H  3.589807 3.255678 -0.547047
H  1.589127 2.41883 -0.040198
