program: Gaussian 09
title: Title Card Required
version: ES64L-G09RevD.01
method: UB3LYP
basis: Gen
operation: Freq
keyword: #P
keyword: Geom=AllCheck
keyword: Guess=TCheck
keyword: SCRF=Check
keyword: GenChk
keyword: UB3LYP/ChkBas
keyword: Freq
converged: YES YES YES YES
polarizability: 2.11080326e+02 -3.45791787e+01 1.92952886e+02 -2.32315027e+01 -1.99069148e+01 7.11683320e+01
1716.lowfreq: -12.9525 -6.1087 -0.0003 0.0005 0.0006 8.6705 32.6047 34.3505 56.4581
frequency: 30.7999 34.0549 56.2355 70.4142 83.4990 100.1931 116.5757 150.2794 175.2268 229.8251 259.6761 307.1492 330.4850 382.0760 416.4232 422.3410 525.7107 571.9163 619.6948 632.2148 692.6372 706.5296 716.0931 773.3660 838.2488 860.6637 881.5902 918.0165 959.9230 974.6878 993.1517 995.7363 1008.4303 1011.4748 1058.5972 1060.0396 1121.0398 1172.8269 1194.5378 1219.8605 1279.1638 1298.1110 1340.4385 1371.8108 1374.9034 1418.8762 1436.7244 1483.1176 1495.3634 1501.5812 1509.8263 1520.9456 1547.5932 1590.5923 1648.8607 1661.6661 1675.2022 2998.8432 3007.4013 3038.6702 3062.9289 3107.7264 3155.3982 3172.7912 3182.1805 3192.1235 3202.6585 3279.7427 3436.0732
redmass: 4.3938 3.9170 3.9890 10.9033 5.9285 3.2410 1.3788 3.1092 1.0815 3.9565 3.8532 3.0438 3.8684 4.7231 3.1897 3.3060 3.1122 5.0620 4.8443 6.3184 1.7078 2.8067 2.0357 1.6107 5.1473 1.2512 4.5863 1.4427 1.2291 1.2928 1.2714 2.1133 1.3698 5.0418 1.5102 2.1647 1.5773 2.8643 1.0959 1.1672 2.9647 3.6972 2.5773 3.1435 2.1988 1.2962 1.1961 1.9890 1.0961 1.0537 1.0784 1.1066 2.2575 2.1176 5.4351 4.4735 3.7547 1.0466 1.0452 1.0935 1.0899 1.1013 1.0944 1.0852 1.0895 1.0936 1.0976 1.0914 1.0806
irintensity: 4.1026 1.1093 4.0760 11.2454 7.9465 2.3934 0.9127 1.8916 7.1719 1.6194 4.1177 1.1132 4.7688 14.3563 0.0634 3.5146 9.8548 3.7022 6.8475 0.9613 54.2916 20.1726 26.5521 64.6639 0.7641 0.4836 12.2048 12.8129 0.2138 0.0463 5.8713 15.3903 4.9922 4.2036 2.0276 5.7495 6.7938 191.1911 5.4331 3.4623 149.9495 28.7353 56.2670 92.2869 5.9973 25.2119 6.9475 92.1733 8.7708 1.2024 6.9830 52.5821 163.8293 228.1809 149.2178 31.3893 118.3522 33.8516 58.7062 30.7284 31.6897 42.0400 10.9481 0.9804 58.4134 0.3221 70.3449 2.9935 465.5136
temp: 298.150 k
press: 1.00000 atm
elementType: 6 8 7 1 6 6 6 1 1 1 1 1 1 35 6 6 6 6 1 6 1 6 1 1 1
symmnumber: 1
zpe: 524344.5 jmol-1
zpe.correction: 0.199712 hartree
zpe.thermalcorrener: 0.213841 hartree
zpe.thermalcorrenthalpy: 0.214785 hartree
zpe.thermalcorrgfe: 0.154782 hartree
zpe.sumelectzpe: -531.607780 hartree
zpe.sumelectthermal: -531.593651 hartree
zpe.sumelectthermalent: -531.592707 hartree
zpe.sumelectthermalfe: -531.652710 hartree
dipole: -11.6678 -5.2244 5.9297
dipole: 14.0924
quadrupole: -127.1246 -121.8524 -103.5197
quadrupole: -30.0206 17.2460 15.3007
quadrupole: -9.6257 -4.3535 13.9792 -30.0206 17.2460 15.3007
hfenergy: -531.8074919 hartree
pointgroup: C01 [X(C10H12Br1N1O1)]
dipole: -2.1890552 -3.6498418 2.2059661 debye
dipolederiv: 2.0714262 -0.5706237 -0.1996048 0.116724 1.1473435 0.0131115 -0.2388848 0.1358157 0.2988315 -1.0336653 -0.0181097 0.0682981 -0.4644726 -1.0635269 0.0174747 0.0813215 -0.0322004 -0.4162138 -1.9981505 0.7733109 0.1283351 0.5246518 -0.9465236 0.0024397 0.0989483 -0.051641 -0.4005936 0.2558229 0.2017848 -0.0946174 0.2327567 0.4862804 -0.1336359 -0.0283132 -0.1400788 0.341831 0.2899983 0.2877309 0.0588092 0.2355328 0.0235778 0.0367374 0.0029733 0.0679021 -0.0853158 -0.1755183 -0.2027215 0.0500801 -0.1375866 -0.1009223 0.042581 0.1072685 0.1087895 -0.0070078 -0.0374079 -0.0472309 -0.02909 0.1141566 -0.0542504 -0.0340275 0.0060748 -0.041597 0.1392827 -0.0196205 -0.0062819 -0.1003348 0.0306021 0.0253689 0.0197398 -0.1214234 -0.0382008 -0.0140818 0.2557398 0.0411297 -0.059876 0.0090711 0.0246704 -0.0077606 -0.0526269 -0.0541714 0.0525548 -0.0594629 0.1353431 0.0552283 0.1261709 -0.0921135 -0.0476831 0.0500825 -0.0873397 0.0577395 0.0883824 -0.0680285 -0.0178522 -0.1421731 -0.0250881 -0.0437997 -0.0115946 -0.0400495 0.0658486 -0.1050477 0.0795132 0.0704842 0.0257704 0.0601835 -0.0665072 0.119391 -0.0729629 -0.1027017 -0.0520102 0.0807459 -0.027088 0.0659409 -0.0220096 0.1121598 -0.0896663 0.1196312 -0.0250713 -1.0083161 -0.1215116 0.083672 -0.0935763 -1.1429579 0.1056176 0.0760854 0.1453042 -0.9482588 0.8280143 -0.7734722 0.0120669 -0.9226217 0.8622544 0.0376721 -0.0068844 0.0431543 0.1571825 -0.3338467 0.3084477 -0.0369374 0.0774037 -0.1706422 -0.0046406 0.0145077 -0.0507607 -0.1536882 -0.1222153 0.0243137 -0.0150396 0.2455922 -0.3243882 -0.0256853 -0.054038 0.0307841 -0.1588174 0.2152837 -0.0652893 -0.0502512 0.0251888 0.1227773 -0.0567518 -0.0879911 -0.0363995 -0.0995754 0.0901249 -0.041876 0.0285171 -0.0215446 0.1792573 -0.0279655 0.0267056 -0.0297575 0.1402848 0.0917099 0.0669524 -0.0653879 -0.048576 0.1919986 -0.055194 -0.0219455 -0.0812609 -0.1092173 0.0541793 -0.0800192 0.0395121 -0.0473775 0.1385291 0.0091843 0.0413734 -0.0050227 0.120836 -0.1426833 -0.058319 0.0052081 -0.0118718 -0.1495971 0.0043956 -0.0038264 0.0110826 -0.1722621 -0.1446133 -0.0270399 0.0606433 -0.0540279 0.0626965 0.0234856 0.0676913 0.0172545 0.1011784 0.0552939 -0.0556126 0.0241605 -0.0246133 -0.1644854 0.0660869 0.0136652 0.0722039 0.0961796 -0.0634176 0.1368636 0.0110644 0.1388794 -0.0684324 0.0129653 0.011106 0.0095205 0.1210555 unknown
polarizability: 211.0803262|-34.5791787|192.9528858|-23.2315027|-19.9069148|71.168332 unknown
InChI: InChI=1/C10H12NO.Br/c1-8(2)10(12)11-9-6-4-3-5-7-9;/h3-7,11H,1-2H3;
charge -1 multiplicity 2
25 atoms
C  -0.23040542 -0.58284459 0.0797213
O  -0.82835997 -1.67236207 0.13844465
N  1.14858523 -0.486838 -0.0375398
H  1.53657769 0.42097526 -0.30013883
C  -0.95588155 0.68533197 0.16408023
C  -0.28304335 1.9902626 0.44982853
C  -2.44350396 0.65276673 0.03626423
H  0.44762779 1.90449575 1.26536973
H  0.28705169 2.3704685 -0.41239662
H  -1.01756017 2.75488169 0.72739118
H  -2.80011362 -0.34467116 -0.2285644
H  -2.92899669 0.95459276 0.97875879
H  -2.78329937 1.37239677 -0.72410339
Br 2.91633031 2.42963124 -1.49015251
C  2.0820785 -1.53744378 -0.05191133
C  3.40898607 -1.21601783 -0.40314172
C  1.77293353 -2.86756611 0.2933032
C  4.39517798 -2.19796573 -0.40707662
H  3.64933235 -0.19296924 -0.68136438
C  2.7770736 -3.83739634 0.28417767
H  0.75693586 -3.12601596 0.55252178
C  4.09099866 -3.51878012 -0.06300196
H  5.4100848 -1.92354053 -0.68538527
H  2.51860544 -4.85939712 0.5535393
H  4.8631346 -4.28420572 -0.06856873
