program: Gaussian 09
title: Title Card Required
version: ES64L-G09RevD.01
method: UB3LYP
basis: Gen
operation: Freq
keyword: #P
keyword: Geom=AllCheck
keyword: Guess=TCheck
keyword: SCRF=Check
keyword: GenChk
keyword: UB3LYP/ChkBas
keyword: Freq
converged: YES YES NO YES
polarizability: 6.83729456e+02 -2.30500423e+02 4.49035941e+02 6.57607432e+01 -4.71142263e+01 1.60270407e+02
1716.lowfreq: -0.0010 -0.0009 0.0005 9.3515 11.9856 20.8324 22.6425 34.2059 56.3200
frequency: 20.5993 21.8453 55.2016 73.0469 88.1362 103.6653 143.9451 156.7001 168.7298 182.2694 225.1845 237.4512 266.4392 279.2181 292.6698 308.4049 404.1221 424.2337 427.6153 436.4803 455.4626 491.0217 518.0632 519.3373 533.1768 560.3603 570.0509 579.1039 581.0801 621.3192 627.1441 660.7993 692.9200 737.8002 739.3622 752.6412 793.5301 793.9335 817.4076 821.0525 848.0856 857.9158 870.9254 887.9287 926.3749 959.5663 975.7636 979.9730 990.7474 997.4794 1009.9212 1017.7293 1021.6116 1021.8217 1049.3462 1055.1501 1083.4866 1115.4057 1116.7311 1136.1840 1179.1691 1189.1180 1199.3026 1211.0621 1245.5677 1249.9885 1260.0177 1263.7465 1293.1180 1333.0618 1361.8853 1370.1694 1373.0410 1384.4054 1455.4570 1463.9467 1467.9648 1481.3577 1496.1185 1525.3287 1540.7538 1566.0872 1602.1627 1632.2490 1638.1914 1641.6389 1654.9359 1674.5436 2091.6895 3203.1125 3210.5999 3210.7290 3214.9345 3218.3659 3218.3877 3225.7170 3226.2675 3230.0929 3230.5697 3231.8097 3244.3079 3245.9260
redmass: 7.0005 6.7723 3.8731 5.3531 5.8168 5.7029 7.3636 4.3994 7.6273 10.6876 7.4594 3.5691 5.1204 7.6328 9.4034 9.3965 2.9594 4.5606 3.9761 7.1059 3.9216 7.0081 3.7394 4.1670 7.8543 3.0597 7.5960 6.3833 6.3178 3.9467 6.6839 8.1514 1.7497 6.1194 3.5172 6.6004 1.8702 1.2027 6.3115 1.5034 4.4420 1.2502 1.6075 6.4609 5.2878 1.3798 1.3844 1.3951 1.3541 1.3190 6.1295 1.3572 1.3151 1.3658 2.2236 5.3690 2.4614 2.2657 1.5954 2.1251 1.2573 1.2222 1.1016 1.1786 2.8493 1.5352 1.8252 4.1023 1.7786 2.3403 3.9854 2.2390 6.6339 2.2692 2.0339 3.5180 2.0922 2.3263 3.4552 2.0935 3.2284 4.2613 4.2873 6.2544 5.1577 5.6047 6.7064 6.5916 11.9966 1.0870 1.0884 1.0889 1.0912 1.0923 1.0908 1.0955 1.0966 1.0986 1.0922 1.0918 1.0976 1.0974
irintensity: 0.7928 0.8715 0.0174 2.7320 2.2711 1.1560 2.9397 0.2374 2.3514 0.8688 7.1601 3.1547 0.2227 115.4179 13.0010 46.9093 0.0365 1.1783 0.0402 44.4919 0.0490 2.2623 0.3763 1.1665 0.3678 0.0065 0.0414 6.1337 4.3702 0.0555 0.2940 8.2989 34.9470 16.2563 46.4967 28.8159 36.6499 9.6605 167.7728 0.0227 0.0304 0.0442 77.9752 13.3957 0.3585 2.3363 0.3077 0.9466 0.0397 0.0170 49.5613 1.3862 0.0666 0.2806 1.5206 0.7755 19.4030 0.5642 6.7418 29.8872 13.2654 1.9736 1.1000 165.0575 0.1313 19.7175 7.7268 26.0380 0.0674 1.8238 2.6485 7.9071 9.4998 78.0162 14.4608 15.3357 66.2717 15.0294 77.5712 9.4744 17.7372 198.4454 0.6930 27.4506 609.7480 61.9480 1.4966 2.7874 3170.3800 0.2477 0.1283 1.7246 2.3265 4.7083 1.5928 11.6755 12.5637 54.2921 0.1749 0.0799 2.9239 3.2927
temp: 298.150 k
press: 1.00000 atm
elementType: 6 6 6 6 6 6 6 6 6 6 1 6 6 1 1 1 1 1 1 1 7 7 29 6 6 6 6 6 6 1 6 1 6 1 1 1
symmnumber: 1
zpe: 722906.7 jmol-1
zpe.correction: 0.275341 hartree
zpe.thermalcorrener: 0.293446 hartree
zpe.thermalcorrenthalpy: 0.294390 hartree
zpe.thermalcorrgfe: 0.226284 hartree
zpe.sumelectzpe: -1076.413698 hartree
zpe.sumelectthermal: -1076.395593 hartree
zpe.sumelectthermalent: -1076.394649 hartree
zpe.sumelectthermalfe: -1076.462755 hartree
dipole: -16.0164 -7.9151 -1.1308
dipole: 17.9012
quadrupole: 4.7228 -63.4178 -129.6333
quadrupole: -1.3701 13.6586 -5.4316
quadrupole: 67.4989 -0.6417 -66.8572 -1.3701 13.6586 -5.4316
hfenergy: -1076.689039 hartree
pointgroup: C01 [X(C20H13Cu1N2)]
dipole: 1.944607 -1.1253381 0.3322215 debye
polarizability: 683.7294561|-230.5004228|449.0359405|65.7607432|-47.1142263|160.2704071 unknown
InChI: InChI=1/C12H8N2.C8H5.Cu/c1-3-9-5-6-10-4-2-8-14-12(10)11(9)13-7-1;1-2-8-6-4-3-5-7-8;/h1-8H;3-7H;/q-2;;+2/rC20H13CuN2/c1-2-6-16(7-3-1)12-13-21-22-14-4-8-17-10-11-18-9-5-15-23(21)20(18)19(17)22/h1-11,14-15H
charge 1 multiplicity 2
36 atoms
C  -3.87727304 -5.36533843 -0.08915504
C  -2.50950136 -5.42663919 0.10428081
C  -1.74778843 -4.23467905 0.10314601
C  -2.45108213 -3.02794338 -0.10238127
C  -4.49276937 -4.11455006 -0.28303216
C  -0.32481291 -4.18175747 0.29388961
C  -1.74745934 -1.77870977 -0.11710287
C  -0.348621 -1.75166947 0.07083136
C  0.3452293 -2.99223431 0.2793283
C  0.27565348 -0.48256552 0.04694937
H  1.35000646 -0.41076178 0.19013218
C  -0.4881203 0.65207712 -0.15627491
C  -1.87907173 0.527193 -0.33213819
H  0.21016887 -5.11334209 0.45225903
H  -4.48520458 -6.26322365 -0.09437528
H  -2.01224446 -6.38025036 0.25715885
H  -5.56307117 -4.02493785 -0.43625564
H  1.42077249 -2.96398922 0.42646934
H  -0.03644861 1.63749289 -0.17892514
H  -2.51226619 1.39384775 -0.48989806
N  -2.48753694 -0.65528135 -0.3125129
N  -3.79671271 -2.98090304 -0.28759033
Cu -4.46796873 -1.07383875 -0.49515663
C  -6.02263428 -0.11725938 -0.70933226
C  -7.07132209 0.5405734 -0.82754177
C  -8.26365213 1.27625162 -0.95483694
C  -8.72363918 1.68403173 -2.23345977
C  -9.01774718 1.61946478 0.19716705
C  -9.90004298 2.41115656 -2.34845797
H  -8.14386733 1.42061352 -3.11246058
C  -10.19448473 2.34325854 0.06652534
H  -8.6623761 1.30609253 1.17372351
C  -10.63699018 2.74062989 -1.20262783
H  -10.24994645 2.72418252 -3.32749371
H  -10.77177767 2.60237965 0.9489236
H  -11.55851233 3.30749759 -1.2991891
