program: Gaussian 09
title: Title Card Required
version: ES64L-G09RevD.01
method: UB3LYP
basis: Gen
operation: Freq
keyword: #p
keyword: freq
keyword: b3lyp/gen
keyword: scrf=(smd,solvent=toluene,read)
keyword: nosymm
keyword: cphf=conver=7
keyword: empiricaldispersion=gd3
keyword: int=(acc2e=11,grid=ultrafine)
keyword: pseudo=cards
title: #p freq b3lyp/gen scrf=(smd,solvent=toluene,read) nosymm cphf=conver=7
converged: NO NO NO NO
polarizability: 2.65473627e+02 -1.47620118e+02 4.03408417e+02 3.48985830e+01 -1.75164121e+02 2.28069274e+02
1716.lowfreq: -115.1263 -93.3019 -67.4608 -49.9058 -24.3970 0.0004 0.0008 0.0009 19.8641
frequency: -108.5787 -65.0861 -48.5095 87.2354 148.2601 180.5777 186.5179 216.6447 222.4409 232.6135 266.3317 316.7210 331.6579 364.9153 423.2467 423.7519 510.0441 558.3796 590.4492 625.2210 637.4428 677.3983 699.9953 744.9113 826.7943 831.2355 873.4781 876.9870 940.7722 944.6491 974.0820 975.9941 1008.4418 1018.4183 1053.2212 1110.4570 1115.5610 1164.9834 1189.1642 1205.6896 1206.7887 1231.0350 1272.1293 1346.2003 1386.0362 1406.1806 1420.9965 1479.1786 1494.4012 1506.1835 1511.7389 1525.3066 1538.1260 1572.3650 1638.1640 1647.8616 1782.2575 3020.6141 3049.0818 3092.0579 3116.2438 3135.2871 3154.8082 3170.4049 3180.7061 3193.3767 3207.2370 3270.6266 3584.6706
redmass: 8.1014 4.0376 7.0580 4.9100 5.3498 1.1781 2.3793 1.2831 5.0714 2.5552 4.0732 3.4702 3.5677 5.7466 3.1003 2.9613 3.0016 1.2147 5.1935 4.5779 5.2303 4.7376 2.2062 1.6228 5.2432 1.2840 2.4017 2.1119 2.8551 1.2945 1.3760 1.2401 5.8493 1.2743 2.1138 1.6145 1.7084 3.0919 1.1241 1.2721 2.1317 3.0004 2.8388 1.4833 5.9711 1.2362 1.2179 2.0984 1.0487 1.0496 1.0493 1.0577 2.2879 1.9663 3.8049 4.7567 9.8046 1.0454 1.0394 1.0882 1.0954 1.1029 1.1032 1.0861 1.0866 1.0922 1.0973 1.0921 1.0768
irintensity: 7.2868 1.4465 0.1747 0.7618 10.3468 4.4205 34.4994 34.7918 176.3487 3.7928 26.8711 11.5354 89.4677 29.0967 12.5754 45.4010 13.8399 96.2906 117.2296 54.8348 61.4958 48.1726 26.0233 53.4915 11.3419 1.9683 31.8858 32.5014 54.8561 0.7626 0.5663 2.7713 129.4136 13.0463 35.3686 30.2147 73.9132 20.7034 17.0480 207.3114 9.5660 308.5246 310.7916 22.6843 110.4098 9.8334 37.6942 21.2510 4.4330 2.4847 19.3392 0.5996 263.3342 140.1615 206.9848 1224.0296 1004.3068 141.9708 168.0526 47.9478 52.5666 42.3199 31.2085 17.1607 3.5806 59.7564 68.0527 2.2081 26.6170
temp: 298.150 k
press: 1.00000 atm
elementType: 6 8 7 1 6 6 6 1 1 1 1 1 1 35 6 6 6 6 1 6 1 6 1 1 1
symmnumber: 1
zpe: 524531.1 jmol-1
zpe.correction: 0.199783 hartree
zpe.thermalcorrener: 0.210864 hartree
zpe.thermalcorrenthalpy: 0.211809 hartree
zpe.thermalcorrgfe: 0.161772 hartree
zpe.sumelectzpe: -531.529141 hartree
zpe.sumelectthermal: -531.518060 hartree
zpe.sumelectthermalent: -531.517115 hartree
zpe.sumelectthermalfe: -531.567152 hartree
dipole: -0.4976 -1.3506 6.8248
dipole: 6.9750
quadrupole: -97.3992 -112.4927 -114.3163
quadrupole: 5.0498 -0.1487 15.3243
quadrupole: 10.6702 -4.4233 -6.2469 5.0498 -0.1487 15.3243
hfenergy: -531.728924 hartree
pointgroup: C01 [X(C10H12Br1N1O1)]
dipole: 2.0237452 -2.102767 2.4465543 debye
dipolederiv: 0.8322542 0.6257015 -0.258674 0.1928013 2.3751493 -1.5681431 0.0732051 -0.6207912 0.3740612 -0.5357094 -1.4744181 1.0146131 -0.1388813 -2.3458672 1.3058078 -0.0257012 0.5332753 -0.6596728 -1.279129 1.0615606 -0.5989845 0.8367082 -1.221737 0.3272885 -0.1948813 0.1827386 -0.4569969 0.0813418 0.1020664 -0.0149227 -0.0172982 0.1189889 0.0569343 0.0131449 0.0711844 0.2941919 -0.2671707 0.9666244 -0.5073346 -0.5182946 -0.090671 0.5651377 1.2410164 -1.3236831 0.3569443 -0.068097 0.1620488 -0.0225261 -0.4076592 0.8010149 -0.15309 -0.0494069 -0.2563322 0.3787445 0.3163259 -0.3009925 -0.0201898 -0.1304276 0.2863937 -0.0941161 0.2709222 -0.3255051 0.1394482 -0.1363316 -0.1335616 -0.0241151 0.0171309 0.0022827 0.0135786 -0.0125642 0.0024228 0.0183463 0.0051393 0.1463177 -0.0008443 0.1360113 -0.1454998 -0.1611797 -0.0350233 0.0875728 -0.0268257 0.0430519 -0.0624779 0.1117411 0.0781445 -0.1749817 0.1284771 0.2788681 -0.2494523 -0.1883842 -0.0188679 -0.0075861 -0.0534303 -0.0931285 0.0028369 -0.0979951 -0.1151885 0.0082535 -0.0994114 -0.2685425 0.224903 0.0327892 -0.1115094 0.0439549 0.0923593 0.1868691 0.0416228 -0.1593258 -0.0386224 0.0595342 0.0291634 0.1808589 -0.189583 0.0167642 -0.0420876 0.0490512 0.0525207 -0.0438929 -0.821801 0.1755269 0.7826556 -1.3926531 -0.0666859 -1.7641038 1.9870255 -1.0312115 1.2682291 -1.6530447 0.6600283 -1.5261374 2.1782377 -0.8750074 0.2634148 -0.282379 0.271353 -1.0853285 1.5590037 -0.6841398 0.132663 -0.3386852 0.1342745 0.1246764 -0.2697268 -0.0925997 -0.1954387 0.0540788 -0.0385997 1.053222 -1.5366412 0.6107022 -0.2999125 0.3935886 -0.3518231 0.3209836 -0.2912788 0.0798969 -0.4479591 1.0635794 -0.5293659 0.0433927 -0.2836207 0.015585 0.0377473 0.00906 0.0040362 -0.0712696 -0.0647266 0.0480732 0.0392603 0.0515434 0.1101929 0.9842759 -0.9094355 0.3332654 -0.2842513 0.5585863 -0.2787277 -0.1268411 -0.0087354 -0.1156983 0.0533167 -0.0723605 0.0477829 -0.032058 0.1582179 -0.0255409 0.0327923 -0.0113101 0.1363349 -0.7911242 0.6530349 -0.3042939 0.3014411 -0.8721366 0.3683957 0.0162141 0.0830498 -0.2663596 -0.2112546 0.0436194 0.0163789 -0.0578207 0.08849 0.0118762 0.073077 0.0038898 0.1044588 0.0685832 -0.1046054 0.0477787 -0.0249665 -0.1911289 0.1131051 0.0099587 0.1091489 0.0712589 -0.0717396 0.1640088 -0.0249464 0.1500248 -0.1134212 0.0570774 -0.0011019 0.0271687 0.1248682 unknown
polarizability: 265.4736266|-147.6201176|403.4084171|34.898583|-175.1641209|228.0692739 unknown
InChI: InChI=1/C10H12BrNO/c1-10(2,11)9(13)12-8-6-4-3-5-7-8/h3-7,12H,1-2H3
charge -1 multiplicity 2
25 atoms
C  -0.008022 -0.389481 -0.138484
O  -0.722523 -1.34315 0.14469
N  1.353155 -0.435492 -0.237736
H  1.807594 0.411806 -0.55425
C  -0.646615 1.010971 -0.299589
C  -0.206803 1.951812 0.817178
C  -2.156537 0.914062 -0.425306
H  0.877614 2.082574 0.857326
H  -0.675321 2.933268 0.704294
H  -0.532457 1.520958 1.773632
H  -2.452106 0.258985 -1.247137
H  -2.557683 0.492325 0.502498
H  -2.5894 1.906036 -0.577448
Br 0.036863 1.848546 -2.102393
C  2.217064 -1.543509 -0.089052
C  3.573112 -1.332797 -0.389705
C  1.793023 -2.80736 0.350353
C  4.494112 -2.367656 -0.25267
H  3.90185 -0.353472 -0.732132
C  2.729486 -3.834391 0.480977
H  0.750494 -2.975672 0.578565
C  4.077692 -3.627694 0.184674
H  5.538879 -2.186552 -0.490225
H  2.391857 -4.809939 0.820812
H  4.795022 -4.436389 0.291183
