program: Gaussian 09
title: Title Card Required
version: ES64L-G09RevD.01
method: UB3LYP
basis: Gen
operation: Freq
keyword: #p
keyword: freq
keyword: b3lyp/gen
keyword: scrf=(smd,solvent=toluene)
keyword: nosymm
keyword: cphf=conver=7
keyword: empiricaldispersion=gd3
keyword: int=(acc2e=11,grid=ultrafine)
keyword: pseudo=cards
title: #p freq b3lyp/gen scrf=(smd,solvent=toluene) nosymm cphf=conver=7 empi
basis: NPDir=0 NMtPBC= 1 NCelOv= 1 NCel= 1 NClECP= 1 NCelD= 1
basis: NCelK= 1 NCelE2= 1 NClLst= 1 CellRange= 0.0.
basis: One-electron integrals computed using PRISM.
converged: NO NO NO NO
polarizability: 7.93184978e+02 -2.43794027e+02 4.31575575e+02 7.81484746e+01 -4.33491261e+01 1.61045258e+02
1716.lowfreq: -45.2658 -13.8705 -0.0013 -0.0011 0.0005 13.3872 21.4546 26.2859 31.6025
frequency: -41.2193 23.5693 28.1526 57.0532 86.2544 91.2955 111.9500 141.2529 145.2815 168.2055 224.9073 236.1099 246.8104 267.7022 271.3228 296.3709 403.9257 407.7056 422.7946 427.3629 456.5233 488.9576 518.6031 520.3250 521.6091 563.6839 564.8030 571.6223 575.9465 619.7089 627.0043 652.3758 692.5608 735.1340 742.1705 743.5219 794.2862 796.3565 812.0787 824.5243 851.2136 857.3022 872.3502 878.4743 916.0477 959.6328 980.0183 982.4474 992.7186 998.3069 1012.6235 1018.3897 1021.5180 1022.1931 1054.4760 1059.9228 1080.0102 1110.6651 1114.8299 1134.6092 1177.2423 1185.6257 1201.1530 1211.0513 1234.1688 1243.3844 1251.9227 1257.8852 1299.2606 1346.7930 1357.1726 1372.5679 1373.5045 1390.8559 1449.1184 1456.1794 1470.0876 1477.4050 1495.0357 1531.6057 1540.8714 1566.7540 1611.8977 1629.2838 1629.6815 1645.2720 1657.6167 1669.9633 2125.6464 3191.1613 3196.8386 3199.9555 3209.3037 3210.9414 3212.7307 3213.3080 3214.2951 3215.2859 3219.6247 3228.5191 3234.6300 3241.7240
redmass: 3.8363 6.8785 6.7555 5.5287 7.3184 5.8871 7.2224 6.5219 6.0191 6.3159 8.5464 3.5977 8.2687 5.6594 8.8509 7.1154 4.7307 3.0032 3.9906 6.9022 3.9146 6.6912 4.0848 4.6611 5.9559 3.0613 7.5461 6.8042 5.6653 3.9542 6.6550 8.1840 1.7745 6.2784 3.5755 6.5602 1.8354 1.1981 6.3993 1.4605 4.8262 1.2524 1.6076 6.4679 5.2340 1.3830 1.3691 1.3972 1.3518 1.3197 6.2361 1.3542 1.3658 1.3136 5.2734 2.2479 2.5453 1.6314 2.3391 2.0812 1.2416 1.2173 1.1066 1.3556 2.8019 2.7530 1.6311 1.7544 1.8430 1.8820 3.8004 5.9852 3.0042 2.4006 4.0583 1.8665 2.3943 2.1336 2.7812 2.0848 3.2299 4.1574 4.4884 6.1967 4.9534 5.5344 6.5248 6.5427 11.9955 1.0875 1.0896 1.0881 1.0902 1.0923 1.0915 1.0926 1.0943 1.0963 1.0983 1.0918 1.0973 1.0976
irintensity: 0.0597 0.7765 0.7120 2.9806 24.2620 3.9160 12.1829 0.7673 0.8032 0.1569 15.4979 2.3445 40.6579 22.2364 134.3561 24.1454 4.9721 0.2201 1.1694 41.6184 0.1133 2.9247 0.7351 0.8109 0.4695 0.0151 0.2832 2.4010 4.5015 0.0256 0.3525 9.8121 33.6972 15.0635 46.0650 31.8855 37.6670 9.2312 144.7677 0.0211 0.3823 0.0537 77.4039 10.9015 0.0863 2.4259 0.0159 1.0846 0.1055 0.0776 66.8852 1.6489 0.0306 0.1028 2.4711 0.8696 19.8620 5.5231 2.2625 28.3924 11.5156 2.5695 2.7481 356.4963 25.5765 1.7600 19.2301 7.0711 0.0021 1.5171 17.5836 18.4261 13.2595 79.5078 30.9907 5.9218 89.6906 13.3381 77.7692 37.1903 15.3190 219.7630 0.9416 23.0305 990.5878 12.8266 0.0299 2.0406 4264.6362 4.5662 2.9229 0.0251 6.7510 0.4595 0.9711 0.4995 10.6574 15.0941 68.2877 2.1736 4.1847 2.1671
temp: 298.150 k
press: 1.00000 atm
elementType: 6 6 6 6 6 6 6 6 6 6 1 6 6 1 1 1 1 1 1 1 7 7 29 6 6 6 6 6 6 1 6 1 6 1 1 1
symmnumber: 1
zpe: 720420.5 jmol-1
zpe.correction: 0.274394 hartree
zpe.thermalcorrener: 0.292005 hartree
zpe.thermalcorrenthalpy: 0.292950 hartree
zpe.thermalcorrgfe: 0.226187 hartree
zpe.sumelectzpe: -1076.408718 hartree
zpe.sumelectthermal: -1076.391106 hartree
zpe.sumelectthermalent: -1076.390162 hartree
zpe.sumelectthermalfe: -1076.456924 hartree
dipole: -16.4963 -7.1477 -1.3097
dipole: 18.0258
quadrupole: 16.8954 -70.9313 -129.5023
quadrupole: -2.7813 15.6317 -4.3745
quadrupole: 78.0748 -9.7519 -68.3229 -2.7813 15.6317 -4.3745
hfenergy: -1076.6831115 hartree
pointgroup: C01 [X(C20H13Cu1N2)]
dipole: 1.7042919 -0.9423384 0.2563076 debye
polarizability: 793.1849777|-243.7940268|431.5755746|78.1484746|-43.3491261|161.0452579 unknown
InChI: InChI=1/C12H8N2.C8H5.Cu/c1-3-9-5-6-10-4-2-8-14-12(10)11(9)13-7-1;1-2-8-6-4-3-5-7-8;/h1-8H;3-7H;/q-1;;+1/rC20H13CuN2/c1-2-6-16(7-3-1)12-13-21-23-15-5-9-18-11-10-17-8-4-14-22-19(17)20(18)23/h1-11,14-15H
charge 1 multiplicity 2
36 atoms
C  -4.003654 -5.177618 -0.135606
C  -2.645711 -5.3391 0.060859
C  -1.805046 -4.202336 0.078464
C  -2.422913 -2.941504 -0.111573
C  -4.519095 -3.877456 -0.315106
C  -0.383625 -4.267209 0.271648
C  -1.618497 -1.742634 -0.102322
C  -0.218221 -1.840785 0.087872
C  0.376615 -3.134853 0.275559
C  0.522972 -0.637714 0.086624
H  1.599627 -0.670863 0.230718
C  -0.13261 0.564308 -0.096965
C  -1.528072 0.562902 -0.274391
H  0.076261 -5.241261 0.415048
H  -4.675663 -6.029404 -0.154404
H  -2.214315 -6.326637 0.201592
H  -5.581298 -3.710385 -0.471606
H  1.451619 -3.191518 0.422772
H  0.405546 1.506177 -0.103523
H  -2.078351 1.48708 -0.417102
N  -2.253716 -0.553331 -0.276942
N  -3.754561 -2.794517 -0.303463
Cu -4.28674 -0.5952 -0.48431
C  -5.951882 0.190003 -0.672142
C  -7.063814 0.706441 -0.799407
C  -8.348709 1.310521 -0.942733
C  -8.886715 1.580397 -2.220554
C  -9.119955 1.656695 0.188984
C  -10.140473 2.172838 -2.356895
H  -8.304854 1.320168 -3.100214
C  -10.373294 2.248255 0.044778
H  -8.720146 1.454119 1.178573
C  -10.8917 2.510308 -1.226983
H  -10.533471 2.37261 -3.351009
H  -10.949355 2.505697 0.930474
H  -11.869299 2.972675 -1.336129
