program: Gaussian 09
title: Title
version: ES64L-G09RevD.01
method: UB3LYP
basis: Gen
operation: Freq
keyword: #p
keyword: freq
keyword: b3lyp/gen
keyword: scrf=(smd,solvent=toluene,read)
keyword: nosymm
keyword: cphf=conver=7
keyword: empiricaldispersion=gd3
keyword: int=(acc2e=11,grid=ultrafine)
keyword: pseudo=cards
title: #p freq b3lyp/gen scrf=(smd,solvent=toluene,read) nosymm cphf=conver=7
converged: NO NO NO NO
polarizability: 7.94935415e+02 -2.44921506e+02 4.32294303e+02 7.83804415e+01 -4.34975940e+01 1.61040681e+02
1716.lowfreq: -42.8713 -35.5441 -26.1471 -0.0014 -0.0012 -0.0008 8.4642 20.1794 25.7440
frequency: -39.0103 -18.4153 -10.5806 52.0074 81.4963 88.0226 104.4739 135.3058 141.3751 153.0813 214.8397 233.9835 238.1553 265.0035 269.9880 295.7267 390.8170 405.4811 419.7860 427.2638 454.3611 488.8670 517.6934 519.4567 520.3247 562.5407 564.2418 567.7818 571.6421 616.7489 624.1708 652.6360 693.1056 734.8226 739.7139 743.6005 794.3764 800.9674 809.7378 826.2102 844.9483 854.3123 875.1839 878.9603 915.8134 956.7228 983.4085 985.7813 989.2801 1002.9975 1011.0392 1020.2049 1023.2204 1026.4751 1054.5289 1059.1503 1080.8135 1108.8773 1115.7784 1136.6269 1181.8166 1190.3209 1199.0046 1206.9308 1231.2661 1243.1312 1254.7712 1259.8138 1300.6070 1344.6407 1357.4283 1371.0153 1375.1952 1391.9090 1449.0153 1461.1576 1471.9943 1474.9816 1497.6079 1528.0344 1543.0685 1567.4184 1610.2961 1628.4569 1629.1401 1646.0058 1657.4921 1669.4061 2124.0778 3191.6868 3197.1561 3199.7231 3209.4086 3211.0879 3213.0388 3213.5045 3214.2179 3215.4208 3219.6626 3228.5942 3234.8469 3242.2729
redmass: 3.8713 7.3192 7.4425 5.4666 6.3179 6.5549 6.9404 5.6649 7.9211 5.3633 8.8700 3.6344 8.6761 5.4286 9.7279 7.0241 4.8611 2.9964 3.9610 6.9783 3.9363 6.6645 4.0089 5.4426 5.1940 3.0877 7.2864 5.5683 6.8682 3.9788 6.6457 8.1991 1.7338 6.2948 3.7196 6.6810 1.8620 1.1966 6.4060 1.8034 2.9860 1.2511 1.5766 6.4779 5.2816 1.3823 1.3702 1.3942 1.3437 1.3138 6.2247 1.3175 1.3494 1.3590 5.3649 2.2414 2.5857 1.6212 2.3678 2.1495 1.2573 1.2377 1.1031 1.3744 2.6945 3.0754 1.5483 1.7636 1.8779 1.6697 3.7162 5.7220 3.8015 2.3764 4.4992 1.8762 2.2519 2.1412 2.5974 2.0998 3.1149 4.0714 4.5327 4.9982 6.0897 5.3946 6.3265 6.3781 11.9952 1.0877 1.0897 1.0878 1.0900 1.0924 1.0915 1.0925 1.0943 1.0960 1.0984 1.0918 1.0972 1.0975
irintensity: 0.0616 0.4778 0.6106 3.0177 10.0936 18.2988 14.5874 0.7699 0.3882 0.2129 14.6003 3.1957 32.6079 6.2731 158.9277 22.7112 3.9926 0.0135 0.4228 43.0188 0.1331 2.7589 0.5033 1.0915 0.6126 0.0163 0.9147 3.4260 1.8773 0.0230 0.3891 9.6933 34.9275 15.1403 42.7790 32.9491 37.2457 9.7660 139.2314 0.0447 0.1307 0.0552 80.3185 10.9943 0.0649 2.4231 0.0270 1.1127 0.1001 0.0573 64.1871 0.1042 1.5810 0.0260 2.5411 0.5286 20.4164 5.5085 2.3423 29.5849 11.2749 2.5979 3.2657 359.0914 24.2343 3.6642 17.9869 7.3430 0.0596 0.7101 15.9764 18.2987 13.9858 85.6095 36.8402 9.4151 84.7160 13.9958 77.3754 38.3569 15.0477 219.3722 0.8252 989.1837 23.9266 10.7184 0.0423 2.1482 4059.7686 4.4075 2.7607 0.0619 7.1047 0.4864 1.1361 0.4311 9.2861 17.9998 64.5727 2.5701 5.0929 2.9024
temp: 298.150 k
press: 1.00000 atm
elementType: 6 6 6 6 6 6 6 6 6 6 1 6 6 1 1 1 1 1 1 1 7 7 29 6 6 6 6 6 6 1 6 1 6 1 1 1
symmnumber: 1
zpe: 719557.1 jmol-1
zpe.correction: 0.274065 hartree
zpe.thermalcorrener: 0.290054 hartree
zpe.thermalcorrenthalpy: 0.290998 hartree
zpe.thermalcorrgfe: 0.229534 hartree
zpe.sumelectzpe: -1076.407280 hartree
zpe.sumelectthermal: -1076.391292 hartree
zpe.sumelectthermalent: -1076.390348 hartree
zpe.sumelectthermalfe: -1076.451811 hartree
dipole: -16.5099 -7.1551 -1.3079
dipole: 18.0412
quadrupole: 17.7683 -70.6002 -129.4578
quadrupole: -3.0693 15.7216 -4.4244
quadrupole: 78.5315 -9.8370 -68.6946 -3.0693 15.7216 -4.4244
hfenergy: -1076.6813452 hartree
pointgroup: C01 [X(C20H13Cu1N2)]
dipole: 1.6989163 -0.9452619 0.2570353 debye
polarizability: 794.9354152|-244.9215057|432.2943032|78.3804415|-43.497594|161.0406813 unknown
InChI: InChI=1/C12H8N2.C8H5.Cu/c1-3-9-5-6-10-4-2-8-14-12(10)11(9)13-7-1;1-2-8-6-4-3-5-7-8;/h1-8H;3-7H;/q-1;;+1/rC20H13CuN2/c1-2-6-16(7-3-1)12-13-21-23-15-5-9-18-11-10-17-8-4-14-22-19(17)20(18)23/h1-11,14-15H
charge 1 multiplicity 2
36 atoms
C  -4.003654 -5.177618 -0.135606
C  -2.645711 -5.3391 0.060859
C  -1.805046 -4.202336 0.078464
C  -2.422913 -2.941504 -0.111573
C  -4.519095 -3.877456 -0.315106
C  -0.383625 -4.267209 0.271648
C  -1.618497 -1.742634 -0.102322
C  -0.218221 -1.840785 0.087872
C  0.376615 -3.134853 0.275559
C  0.522972 -0.637714 0.086624
H  1.599627 -0.670863 0.230718
C  -0.13261 0.564308 -0.096965
C  -1.528072 0.562902 -0.274391
H  0.076261 -5.241261 0.415048
H  -4.675663 -6.029404 -0.154404
H  -2.214315 -6.326637 0.201592
H  -5.581298 -3.710385 -0.471606
H  1.451619 -3.191518 0.422772
H  0.405546 1.506177 -0.103523
H  -2.078351 1.48708 -0.417102
N  -2.253716 -0.553331 -0.276942
N  -3.754561 -2.794517 -0.303463
Cu -4.28674 -0.5952 -0.48431
C  -5.951882 0.190003 -0.672142
C  -7.063814 0.706441 -0.799407
C  -8.348709 1.310521 -0.942733
C  -8.886715 1.580397 -2.220554
C  -9.119955 1.656695 0.188984
C  -10.140473 2.172838 -2.356895
H  -8.304854 1.320168 -3.100214
C  -10.373294 2.248255 0.044778
H  -8.720146 1.454119 1.178573
C  -10.8917 2.510308 -1.226983
H  -10.533471 2.37261 -3.351009
H  -10.949355 2.505697 0.930474
H  -11.869299 2.972675 -1.336129
