program: Gaussian 09
title: Title Card Required
version: ES64L-G09RevD.01
method: UB3LYP
basis: Gen
operation: Freq
keyword: #p
keyword: freq
keyword: b3lyp/gen
keyword: scrf=(smd,solvent=toluene)
keyword: nosymm
keyword: cphf=conver=7empiricaldispersion=gd3
keyword: int=(acc2e=11,grid=ultrafine)
keyword: pseudo=cards
title: #p freq b3lyp/gen scrf=(smd,solvent=toluene) nosymm cphf=conver=7 empi
basis: NPDir=0 NMtPBC= 1 NCelOv= 1 NCel= 1 NClECP= 1 NCelD= 1
basis: NCelK= 1 NCelE2= 1 NClLst= 1 CellRange= 0.0.
basis: One-electron integrals computed using PRISM.
converged: NO NO NO NO
polarizability: 2.63986622e+02 -1.45581479e+02 4.00435202e+02 3.39965055e+01 -1.73753854e+02 2.27326857e+02
1716.lowfreq: -115.6023 -93.4775 -67.7708 -50.8052 -24.4153 0.0002 0.0005 0.0007 18.3139
frequency: -109.2629 -65.5590 -49.3208 87.2307 148.2147 181.3351 186.8734 217.4300 222.8092 233.0828 266.1107 316.6897 332.1890 364.9452 422.6937 423.6675 509.9069 555.6146 590.4081 625.3561 637.5212 677.5900 699.3419 744.7457 826.7453 830.5615 873.6173 877.2295 940.3117 944.2615 972.4760 976.4934 1008.4330 1016.2515 1053.0442 1110.1631 1113.7924 1164.6682 1188.3718 1204.6927 1205.8533 1229.9629 1271.6995 1345.6071 1385.2707 1403.4179 1417.5766 1478.3153 1490.5872 1502.8324 1507.9684 1520.4540 1537.4489 1571.1936 1638.0867 1647.6089 1781.9027 3020.8897 3049.1901 3092.2152 3116.2847 3135.3684 3154.7416 3170.6395 3181.1103 3193.7122 3207.4720 3270.7896 3584.6847
redmass: 8.0788 4.0359 7.0974 4.9264 5.3719 1.1481 2.5329 1.2752 5.2286 2.5031 4.0648 3.4698 3.6029 5.7282 3.1376 2.9140 2.9811 1.2103 5.2149 4.6167 5.1959 4.7869 2.2028 1.6274 5.1736 1.2896 2.6795 1.9290 2.8428 1.2937 1.3746 1.2420 5.7138 1.2802 2.1121 1.6207 1.6976 3.0887 1.1221 1.3014 2.0364 3.0518 2.8208 1.4816 5.9711 1.2370 1.2212 2.1000 1.0489 1.0498 1.0493 1.0571 2.2948 1.9634 3.8609 4.8189 9.8451 1.0454 1.0394 1.0883 1.0955 1.1030 1.1032 1.0863 1.0867 1.0922 1.0973 1.0921 1.0768
irintensity: 7.2622 1.4510 0.1736 0.7443 9.9333 2.8237 33.9024 27.9623 173.8846 4.2394 27.1795 11.2141 85.0876 29.0555 3.9849 53.2975 14.2232 95.5146 114.0224 51.9418 61.4031 47.5175 26.0013 53.9758 10.9857 2.0573 34.9945 28.1920 55.2294 0.7023 0.5010 2.7607 127.6512 11.2419 34.3401 38.2021 65.5844 22.2645 14.5247 209.9686 11.2287 305.5247 313.6074 25.7801 110.8248 9.0037 34.9327 23.4715 5.5323 2.8326 16.8972 0.7189 267.6699 149.6345 192.0072 1212.6007 998.0073 137.6331 164.8128 46.3981 51.8837 40.7210 30.6220 16.7810 3.6239 57.4269 64.7097 2.1833 26.5335
temp: 298.150 k
press: 1.00000 atm
elementType: 6 8 7 1 6 6 6 1 1 1 1 1 1 35 6 6 6 6 1 6 1 6 1 1 1
symmnumber: 1
zpe: 524309.8 jmol-1
zpe.correction: 0.199699 hartree
zpe.thermalcorrener: 0.210780 hartree
zpe.thermalcorrenthalpy: 0.211724 hartree
zpe.thermalcorrgfe: 0.161694 hartree
zpe.sumelectzpe: -531.530817 hartree
zpe.sumelectthermal: -531.519736 hartree
zpe.sumelectthermalent: -531.518792 hartree
zpe.sumelectthermalfe: -531.568822 hartree
dipole: -0.4541 -1.4042 6.8381
dipole: 6.9955
quadrupole: -97.2061 -112.3559 -114.3462
quadrupole: 4.8949 -0.1373 15.3318
quadrupole: 10.7633 -4.3865 -6.3768 4.8949 -0.1373 15.3318
hfenergy: -531.7305159 hartree
pointgroup: C01 [X(C10H12Br1N1O1)]
dipole: 2.0408735 -2.1238845 2.4517669 debye
dipolederiv: 0.856141 0.5916647 -0.2438482 0.1793425 2.3905907 -1.5719354 0.0667375 -0.6109133 0.3706026 -0.5389912 -1.4673023 1.0103752 -0.1326575 -2.3513063 1.3060217 -0.0224783 0.5291905 -0.6566488 -1.2988416 1.0864731 -0.6092261 0.8418282 -1.2292202 0.3286353 -0.1938072 0.1807164 -0.4570792 0.0823369 0.1010946 -0.0144087 -0.0167989 0.1192875 0.0569657 0.0142085 0.069695 0.2946335 -0.2685647 0.9642983 -0.504519 -0.5020511 -0.1134226 0.5741229 1.2249986 -1.3001048 0.3440091 -0.0712668 0.161022 -0.0222657 -0.4032977 0.7906048 -0.152233 -0.0479653 -0.2580995 0.3737437 0.3114856 -0.2974019 -0.0217485 -0.1279724 0.2822333 -0.0935433 0.2684404 -0.3214866 0.1361626 -0.1338356 -0.1314472 -0.0237113 0.0167736 0.0041549 0.0138671 -0.0125302 0.0031264 0.0187938 0.0058326 0.1450532 -0.0011241 0.1337411 -0.1420162 -0.1594155 -0.0343857 0.0869102 -0.0260018 0.0434562 -0.0620088 0.1106537 0.0771724 -0.1718164 0.1262333 0.2746816 -0.2451706 -0.1863113 -0.0182121 -0.0076998 -0.0529588 -0.0931328 0.003048 -0.0975939 -0.1145078 0.0076365 -0.0984776 -0.265148 0.2209889 0.0341698 -0.1109791 0.0434814 0.0924886 0.185026 0.0422785 -0.1582416 -0.0375238 0.0588714 0.0290865 0.1791312 -0.1874497 0.0168655 -0.0417206 0.0487453 0.0526892 -0.0530705 -0.8091969 0.1697098 0.7720653 -1.3760059 -0.0738309 -1.7423169 1.9557665 -1.0181759 1.2657656 -1.6483304 0.6577425 -1.5255608 2.1749255 -0.8717938 0.2636751 -0.2820943 0.272166 -1.0749399 1.5408343 -0.6757613 0.1293359 -0.3355115 0.1319284 0.1234734 -0.2667881 -0.0943613 -0.1928345 0.0522008 -0.0384007 1.0427868 -1.522391 0.6036235 -0.2973867 0.3890932 -0.3502657 0.3147002 -0.2866907 0.0783726 -0.438916 1.045533 -0.5210074 0.0415706 -0.2789596 0.0136099 0.0394484 0.0082721 0.0043436 -0.0686004 -0.0639015 0.048266 0.0382579 0.051493 0.110428 0.9681167 -0.8895445 0.3252143 -0.2813983 0.5511876 -0.2750602 -0.1245612 -0.0098217 -0.1149837 0.0533005 -0.0727127 0.047919 -0.0328593 0.1590322 -0.0258257 0.0330522 -0.0118924 0.1365089 -0.7810865 0.6415518 -0.2992242 0.2961147 -0.8620878 0.3633196 0.0165596 0.0817227 -0.2647247 -0.2061323 0.0420545 0.0166605 -0.0566826 0.0884192 0.012035 0.0719758 0.0042274 0.1047155 0.0686397 -0.1031907 0.0471534 -0.0251657 -0.1874022 0.1117238 0.0100399 0.1078379 0.0720865 -0.0687758 0.1611464 -0.0242044 0.147781 -0.1099671 0.0561429 -0.0010371 0.0268916 0.1251222 unknown
polarizability: 263.9866223|-145.5814787|400.4352019|33.9965055|-173.7538536|227.3268569 unknown
InChI: InChI=1/C10H12BrNO/c1-10(2,11)9(13)12-8-6-4-3-5-7-8/h3-7,12H,1-2H3
charge -1 multiplicity 2
25 atoms
C  -0.008022 -0.389481 -0.138484
O  -0.722523 -1.34315 0.14469
N  1.353155 -0.435492 -0.237736
H  1.807594 0.411806 -0.55425
C  -0.646615 1.010971 -0.299589
C  -0.206803 1.951812 0.817178
C  -2.156537 0.914062 -0.425306
H  0.877614 2.082574 0.857326
H  -0.675321 2.933268 0.704294
H  -0.532457 1.520958 1.773632
H  -2.452106 0.258985 -1.247137
H  -2.557683 0.492325 0.502498
H  -2.5894 1.906036 -0.577448
Br 0.036863 1.848546 -2.102393
C  2.217064 -1.543509 -0.089052
C  3.573112 -1.332797 -0.389705
C  1.793023 -2.80736 0.350353
C  4.494112 -2.367656 -0.25267
H  3.90185 -0.353472 -0.732132
C  2.729486 -3.834391 0.480977
H  0.750494 -2.975672 0.578565
C  4.077692 -3.627694 0.184674
H  5.538879 -2.186552 -0.490225
H  2.391857 -4.809939 0.820812
H  4.795022 -4.436389 0.291183
