program: Gaussian 09
title: Title Card Required
version: ES64L-G09RevD.01
method: RB3LYP
basis: Gen
operation: Freq
keyword: #P
keyword: Geom=AllCheck
keyword: Guess=TCheck
keyword: SCRF=Check
keyword: GenChk
keyword: RB3LYP/ChkBas
keyword: Freq
converged: YES YES YES YES
title: Mulliken charges:
elementType: C O N H C C C H H H H H H Br C C C C H C H C H H H
charge: 0.622468 -0.459338 -0.667501 0.356493 -0.272520 -0.428338 -0.416053 0.177464 0.190930 0.187286 0.190912 0.182988 0.175673 -0.117956 0.328838 -0.207615 -0.171558 -0.143730 0.148806 -0.153717 0.179100 -0.137227 0.146080 0.146605 0.141910
chargesum: 0.00000
title: Mulliken charges with hydrogens summed into heavy atoms:
elementType: C O N C C C Br C C C C C C
charge: 0.622468 -0.459338 -0.311008 -0.272520 0.127342 0.133521 -0.117956 0.328838 -0.058809 0.007541 0.002350 -0.007112 0.004683
polarizability: 1.75062654e+02 -2.81579855e+01 1.64762887e+02 -1.31502072e+01 -3.36073677e+01 1.03321383e+02
1716.lowfreq: -4.0825 -0.0005 -0.0004 0.0001 11.8347 17.8375 29.4241 50.2940 60.1657
frequency: 26.7881 50.0122 59.6593 101.1577 165.3291 217.1277 250.8964 269.7812 270.1111 291.3481 308.5850 335.2931 374.7381 392.0350 422.2281 459.9300 522.8243 595.0161 603.0613 632.2936 661.9953 708.3865 752.1160 775.7428 837.7115 852.3376 901.4910 919.5245 959.3310 970.8703 973.1438 1001.2635 1014.4023 1041.3838 1060.4086 1121.7930 1136.0080 1190.8047 1199.2927 1218.6094 1223.1674 1279.3996 1286.4482 1358.3839 1370.6269 1435.9870 1452.0093 1487.0104 1496.4792 1503.1888 1517.7130 1525.3125 1544.5916 1584.4337 1656.2871 1662.8161 1769.3595 3053.6830 3074.1888 3129.1628 3144.7696 3158.6481 3170.6078 3176.4665 3192.4516 3202.1662 3215.6657 3275.4858 3593.9675
redmass: 4.5479 6.0075 5.6966 5.4927 6.8687 3.4754 2.2003 1.3408 3.4806 3.0748 1.1813 3.8011 5.4745 4.2590 3.0984 3.1296 2.9248 5.1321 1.2042 6.1934 3.7754 2.2297 4.8860 1.6782 5.2146 1.2496 4.6101 1.4383 2.3816 1.3241 1.6008 1.2574 6.0567 1.2863 2.1577 1.5667 1.6497 2.5179 1.1468 1.1545 2.9814 3.3500 2.2681 1.9035 2.8053 1.2325 1.1952 2.0880 1.0627 1.0487 1.0646 1.0533 2.2419 2.0670 4.1113 5.4984 9.5629 1.0419 1.0371 1.0938 1.1006 1.1046 1.1042 1.0886 1.0875 1.0926 1.0976 1.0923 1.0768
irintensity: 5.1924 1.1225 3.1159 0.3864 5.0905 2.1729 1.4869 0.5965 11.0936 7.0162 0.6389 4.5640 14.0200 18.9856 0.1463 18.3481 9.8597 29.9558 67.9419 1.5050 33.7682 17.4695 7.3572 57.1493 3.3441 0.0640 15.2790 9.2590 23.6146 0.0392 8.5695 0.8238 0.0439 3.5559 3.2097 38.8117 88.7356 60.0294 6.5644 6.2723 9.1341 44.5062 42.3259 84.8318 14.0261 13.8830 8.7511 100.1845 1.8133 4.4747 8.3041 12.7212 84.4768 427.2781 70.5293 55.6880 268.3405 7.3673 9.3625 8.9368 10.9427 21.2023 11.8798 12.1145 0.5801 29.4333 25.3637 2.4348 39.5869
temp: 298.150 k
press: 1.00000 atm
elementType: 6 8 7 1 6 6 6 1 1 1 1 1 1 35 6 6 6 6 1 6 1 6 1 1 1
symmnumber: 1
zpe: 533446.6 jmol-1
zpe.correction: 0.203179 hartree
zpe.thermalcorrener: 0.216031 hartree
zpe.thermalcorrenthalpy: 0.216976 hartree
zpe.thermalcorrgfe: 0.162053 hartree
zpe.sumelectzpe: -531.497839 hartree
zpe.sumelectthermal: -531.484986 hartree
zpe.sumelectthermalent: -531.484042 hartree
zpe.sumelectthermalfe: -531.538965 hartree
dipole: 1.5051 1.3550 2.0014
dipole: 2.8473
quadrupole: -75.7320 -84.5224 -91.9230
quadrupole: -4.2091 -1.9353 3.1622
quadrupole: 8.3271 -0.4632 -7.8639 -4.2091 -1.9353 3.1622
hfenergy: -531.701018 hartree
pointgroup: C01 [X(C10H12Br1N1O1)]
dipole: 0.5921537 0.5331177 0.7874156 debye
dipolederiv: 2.1822124 -0.8108098 0.1990176 0.3513917 1.0038111 -0.2838062 -0.2464277 0.0132948 0.0892602 -1.2108505 0.2247337 -0.0134962 -0.5394702 -0.8067035 0.2112092 0.2016557 0.0581703 -0.3459733 -1.7587738 0.8821309 -0.1383125 0.6904946 -0.889228 0.0723186 -0.0595255 -0.0261817 -0.3317617 0.206613 -0.0255351 0.0300048 -0.0158098 0.2120039 0.0151564 0.0626051 0.0194012 0.2932116 0.4389885 0.2185511 -0.3884287 0.0645222 0.2690112 -0.2600411 -0.1864985 -0.4218481 1.1484319 -0.0444571 0.0097672 0.0338551 0.0146906 -0.0674732 0.0685868 -0.0584469 0.0494079 -0.1548411 -0.0766591 -0.0210223 0.0008275 -0.0212212 0.0004567 0.0537112 0.0888381 0.0491723 -0.1235526 -0.1232194 -0.0219927 -0.0287479 -0.0154897 0.0986914 -0.0345616 0.0036129 -0.0030277 0.0607304 0.0462991 0.0826675 -0.0232611 0.0948964 -0.0893374 -0.018904 -0.0014688 -0.0045097 0.0720527 0.0776091 -0.0316725 0.0332163 -0.0408624 0.0611057 0.0113392 0.042519 0.0567394 -0.0950696 0.0499244 -0.0252012 -0.0125647 -0.0474625 0.0312951 -0.086008 -0.0384896 -0.0814053 -0.0052848 0.0276689 -0.0430485 0.078705 -0.0476043 0.0801177 0.0602092 0.032487 0.0566684 -0.0447999 0.011558 0.0485646 -0.0007145 0.0941101 -0.087943 0.0151907 -0.0263502 0.0153692 0.0901574 -0.3692221 -0.0620536 0.188096 0.0138341 -0.4478888 0.23391 0.0880893 0.2886986 -0.7742568 0.6840855 -0.594284 0.0812334 -0.8256941 0.8170331 -0.0733429 0.1269826 -0.0716792 0.1526409 -0.2422413 0.2288094 -0.054237 0.0830363 -0.0532066 -0.038525 -0.0144651 -0.0680575 -0.1503535 -0.0963852 0.0104225 -0.0172787 0.1838532 -0.277041 0.0098817 -0.0466809 0.0292486 -0.1439491 0.1753767 -0.0373218 -0.0373412 0.0589134 0.0512551 -0.0570625 -0.0745859 -0.0372288 -0.0857219 0.0825165 -0.0240586 0.0162201 -0.0270505 -0.0977117 0.0695836 0.0193583 0.0644998 0.1095842 0.0713223 0.0790901 -0.0574095 -0.0099209 0.1736131 -0.0843507 -0.0261559 -0.0904055 -0.0814332 0.0551775 -0.0469756 0.0322893 -0.0340633 0.1535035 -0.0043149 0.0337489 -0.0101499 0.1345778 -0.1156735 -0.076152 0.0136485 -0.0639134 -0.0799722 -0.0005603 0.0137041 -0.0023431 -0.142161 -0.1140711 -0.0146703 0.0437085 -0.0331438 0.071533 0.0213875 0.0515381 0.0171603 0.1088589 0.0559721 -0.0553297 0.0272123 -0.0346705 -0.0897584 0.0685368 0.0188409 0.0715789 0.0966091 -0.013771 0.1053906 -0.0062424 0.106634 -0.0371668 0.0304563 -0.0048852 0.0274266 0.1230437 unknown
polarizability: 175.0626542|-28.1579855|164.7628868|-13.1502072|-33.6073677|103.3213826 unknown
InChI: InChI=1/C10H12BrNO/c1-10(2,11)9(13)12-8-6-4-3-5-7-8/h3-7,12H,1-2H3
charge 0 multiplicity 1
25 atoms
C  -0.00802181 -0.38948112 -0.13848352
O  -0.7225234 -1.34314987 0.14469015
N  1.35315547 -0.435492 -0.23773625
H  1.80759421 0.41180553 -0.5542497
C  -0.64661462 1.01097121 -0.29958859
C  -0.2068025 1.95181225 0.81717806
C  -2.15653674 0.9140615 -0.42530577
H  0.87761359 2.08257419 0.85732601
H  -0.67532128 2.93326773 0.70429395
H  -0.532457 1.52095817 1.77363189
H  -2.45210583 0.25898548 -1.24713727
H  -2.55768348 0.49232512 0.50249786
H  -2.58939952 1.9060362 -0.57744795
Br 0.03686349 1.8485456 -2.1023934
C  2.21706434 -1.54350891 -0.08905226
C  3.57311211 -1.33279689 -0.38970527
C  1.79302326 -2.80736017 0.35035286
C  4.49411216 -2.36765626 -0.25267002
H  3.90185011 -0.35347175 -0.73213204
C  2.72948581 -3.83439058 0.48097694
H  0.75049427 -2.975672 0.57856492
C  4.07769151 -3.62769354 0.18467447
H  5.5388793 -2.18655189 -0.49022532
H  2.39185666 -4.80993892 0.82081191
H  4.79502188 -4.43638907 0.29118336
