program: Gaussian 09
title: Title Card Required
version: ES64L-G09RevD.01
method: RB3LYP
basis: Gen
operation: Freq
keyword: #P
keyword: Geom=AllCheck
keyword: Guess=TCheck
keyword: SCRF=Check
keyword: GenChk
keyword: RB3LYP/ChkBas
keyword: Freq
converged: YES YES YES YES
title: Mulliken charges:
elementType: C C C C C C H H H H H C C H
charge: -0.144453 -0.143396 0.009521 -0.143394 -0.144454 -0.130668 0.148534 0.154796 0.154796 0.148534 0.147274 0.339659 -0.619448 0.222699
chargesum: 0.00000
title: Mulliken charges with hydrogens summed into heavy atoms:
elementType: C C C C C C C C
charge: 0.004081 0.011400 0.009521 0.011403 0.004080 0.016606 0.339659 -0.396749
polarizability: 1.56267526e+02 -1.23767542e-03 8.98481869e+01 5.95443288e-02 -3.88316561e-02 2.89537132e+01
1716.lowfreq: -8.5828 -0.0010 -0.0009 -0.0008 21.1045 48.7772 144.0432 159.9994 382.0867
frequency: 144.0399 159.9938 382.0860 412.8652 472.7025 538.7290 556.7730 591.4212 634.6852 645.2038 707.3060 777.7830 778.5519 859.9420 936.0926 974.2871 1004.0312 1015.2918 1056.9505 1114.0927 1198.4468 1215.6636 1231.1044 1331.2889 1365.9635 1488.0174 1538.5001 1628.7352 1658.6483 2222.4389 3190.3254 3199.0422 3209.0397 3216.8160 3221.5219 3479.1771
redmass: 4.0728 3.9373 4.2473 2.9816 7.1046 7.0797 3.7460 1.2387 5.2510 1.2707 1.9544 5.7396 1.7601 1.2476 1.3940 1.3503 1.2656 6.2339 2.2538 1.5934 1.0982 1.1601 3.5258 3.2125 1.7308 2.2233 2.1743 5.1551 5.4359 6.0968 1.0856 1.0886 1.0923 1.0946 1.0979 1.1590
irintensity: 1.2076 0.7272 1.6037 0.0000 0.4676 1.6217 22.5547 38.2982 2.5049 51.0473 25.0883 4.1597 49.8614 0.0000 4.0689 0.0000 0.1094 0.1485 4.9674 5.9087 0.0104 0.0038 1.5671 0.1480 0.4976 6.2465 19.3354 1.6291 1.6729 4.9107 0.4415 5.9010 22.8556 29.2091 8.4241 121.5997
temp: 298.150 k
press: 1.00000 atm
elementType: 6 6 6 6 6 6 1 1 1 1 1 6 6 1
symmnumber: 1
zpe: 288046.2 jmol-1
zpe.correction: 0.109711 hartree
zpe.thermalcorrener: 0.116154 hartree
zpe.thermalcorrenthalpy: 0.117098 hartree
zpe.thermalcorrgfe: 0.079293 hartree
zpe.sumelectzpe: -308.293086 hartree
zpe.sumelectthermal: -308.286643 hartree
zpe.sumelectthermalent: -308.285699 hartree
zpe.sumelectthermalfe: -308.323504 hartree
dipole: -0.8134 0.0001 -0.0010
dipole: 0.8134
quadrupole: -34.9221 -41.0405 -49.4739
quadrupole: -1.2183 0.0043 -0.0069
quadrupole: 6.8901 0.7716 -7.6617 -1.2183 0.0043 -0.0069
hfenergy: -308.4027968 hartree
pointgroup: C01 [X(C8H6)]
dipole: -0.3200241 0.0000242 -0.000381 debye
dipolederiv: -0.0367339 0.125535 -0.0000499 0.147649 0.083307 -0.0000572 -0.0001133 -0.0000968 -0.1180809 -0.0763374 -0.1000992 0.0000903 -0.0134493 0.0560017 -0.000123 -0.0000025 -0.0001864 -0.1182116 0.341689 -0.000006 0.0001489 -0.0000085 0.0298971 0.0000034 0.0001457 0.0000249 0.0310485 -0.0763465 0.1001055 -0.0000418 0.0134528 0.0559875 -0.0000997 -0.0000303 -0.0000951 -0.1182125 -0.0367408 -0.1255305 0.0001186 -0.1476279 0.0833306 -0.0002129 0.0001797 -0.0002165 -0.1180791 0.0509975 -0.0000004 0.0000797 -0.0000081 -0.0370212 -0.0000436 0.0000964 -0.0000175 -0.1128389 0.0122538 -0.0797194 -0.000002 -0.0967829 -0.0699574 0.0000804 0.0000218 0.0000962 0.126277 0.0396504 0.0835091 -0.0000944 0.066964 -0.0381081 0.0001364 -0.0000904 0.0001677 0.1255267 0.039638 -0.083519 0.0000106 -0.0669697 -0.0380892 0.0000719 0.0000064 0.000085 0.1255263 0.0122632 0.0797161 -0.0001055 0.0967767 -0.0699682 0.0001746 -0.0001215 0.0001807 0.1262768 -0.1264445 0.0000085 -0.00012 0.0000103 0.0762736 0.0000321 -0.0001203 0.0000307 0.1255104 0.2714859 -0.000013 0.0001725 -0.0000238 -0.0858016 0.0000571 0.0005894 0.0000457 0.0036052 -0.7094452 0.0000121 -0.0001835 0.0000269 -0.2714461 -0.0000243 -0.0009136 -0.0000237 -0.3118766 0.2940705 0.0000013 -0.0000235 -0.0000095 0.2255943 0.0000048 0.0003525 0.0000051 0.2335285 unknown
polarizability: 156.267526|-0.0012377|89.8481869|0.0595443|-0.0388317|28.9537132 unknown
InChI: InChI=1/C8H6/c1-2-8-6-4-3-5-7-8/h1,3-7H
charge 0 multiplicity 1
14 atoms
C  -2.56101437 0.28832614 0.00001556
C  -1.16777505 0.28310539 0.00067903
C  -0.45448715 1.49782557 0.0002551
C  -1.16769142 2.71261506 -0.00084985
C  -2.56091671 2.70749852 -0.00152916
C  -3.26129968 1.49793183 -0.00108571
H  -3.10149477 -0.65433577 0.0003808
H  -0.62095488 -0.65498805 0.00155344
H  -0.6207806 3.65065571 -0.00119546
H  -3.10134522 3.65019002 -0.00240483
H  -4.34797572 1.49798302 -0.00160311
C  0.97561426 1.49779465 0.00096816
C  2.1862672 1.49778008 0.00148211
H  3.25431699 1.49779453 0.00145444
