program: Gaussian 09
title: Title Card Required
version: ES64L-G09RevD.01
method: UB3LYP
basis: 6-31G(d)
operation: Freq
keyword: #P
keyword: Geom=AllCheck
keyword: Guess=TCheck
keyword: SCRF=Check
keyword: GenChk
keyword: UB3LYP/6-31G(d)Freq
converged: YES YES NO YES
polarizability: 1.90753539e+02 -4.07742605e+01 1.70484719e+02 6.32041597e+00 7.74861399e+00 5.88600611e+01
1716.lowfreq: -24.3949 -3.7249 -0.0004 -0.0001 0.0005 10.5530 32.4796 54.6502 82.5999
frequency: 26.2847 53.9215 82.3529 120.3882 129.2819 168.4173 238.8102 259.9453 306.0799 323.2708 377.6043 413.9417 423.6306 518.6095 539.7096 573.3510 625.4994 632.5843 694.6641 705.3716 771.6125 839.7814 845.2037 878.1490 910.3573 958.7370 963.3967 991.9650 995.5797 1003.4894 1011.3649 1057.7558 1059.5639 1121.6080 1162.6439 1197.7765 1217.0097 1278.4504 1296.7130 1339.9710 1361.6807 1372.4550 1418.1386 1431.4148 1483.6358 1498.1861 1501.7000 1505.9786 1518.4384 1544.9821 1583.2737 1651.9108 1661.6939 1684.8498 3001.7441 3009.4964 3044.2211 3045.2937 3125.0158 3163.4335 3164.1618 3186.8638 3195.1889 3212.6989 3277.8474 3625.3346
redmass: 2.9806 4.0868 3.4560 1.1674 3.8434 1.1550 3.4940 4.5119 3.0296 3.7714 4.7738 3.1470 3.1912 2.2429 1.3062 5.0576 5.5175 6.1846 6.7225 2.1612 1.6723 4.7846 1.2820 5.1380 1.4138 1.2232 1.3103 2.2254 1.2453 1.3441 5.7242 1.5088 2.1829 1.5687 2.9662 1.0918 1.1420 3.0282 3.2317 2.7620 2.4769 2.5548 1.3081 1.2107 1.9660 1.0785 1.0990 1.0471 1.1113 2.2735 1.9938 4.4516 5.2360 5.2326 1.0426 1.0433 1.0985 1.0986 1.0953 1.0949 1.0887 1.0871 1.0922 1.0970 1.0919 1.0761
irintensity: 0.5124 2.9152 3.6175 0.1752 1.9337 0.2598 1.1648 3.6235 0.7851 4.6905 12.4266 0.0784 4.9866 39.0652 64.8837 3.5098 5.6502 0.0582 4.6014 18.0287 61.9451 0.4524 0.0342 5.4155 7.3851 0.1196 0.1814 8.6953 1.0645 11.9880 0.2567 2.2641 1.1570 18.6666 174.3688 2.2557 6.0950 87.5854 30.7697 43.9973 79.8644 26.4434 23.6264 3.0314 97.3303 11.5751 7.1723 3.0078 45.1037 113.9065 300.2216 104.9359 36.8797 139.7961 18.5568 28.1992 38.9919 0.4738 24.5031 5.7726 16.7203 1.0856 34.0877 32.1305 4.2629 30.9070
temp: 298.150 k
press: 1.00000 atm
elementType: 6 8 7 1 6 6 6 1 1 1 1 1 1 6 6 6 6 1 6 1 6 1 1 1
symmnumber: 1
zpe: 522675.3 jmol-1
zpe.correction: 0.199077 hartree
zpe.thermalcorrener: 0.210971 hartree
zpe.thermalcorrenthalpy: 0.211915 hartree
zpe.thermalcorrgfe: 0.159344 hartree
zpe.sumelectzpe: -518.077656 hartree
zpe.sumelectthermal: -518.065762 hartree
zpe.sumelectthermalent: -518.064818 hartree
zpe.sumelectthermalfe: -518.117389 hartree
dipole: 1.4360 4.2357 0.3535
dipole: 4.4864
quadrupole: -64.5307 -68.3211 -73.5458
quadrupole: -2.2586 0.7813 0.8940
quadrupole: 4.2685 0.4781 -4.7466 -2.2586 0.7813 0.8940
hfenergy: -518.276733 hartree
pointgroup: C01 [X(C10H12N1O1)]
dipole: 0.5649571 1.6664337 0.139091 debye
dipolederiv: 2.0209028 -0.6388743 0.0552033 0.0161511 1.1476256 0.0500747 0.1113642 0.0022223 0.3195973 -0.9945023 0.0223918 -0.0313739 -0.4038008 -0.9806001 -0.0527307 -0.0608156 -0.0321411 -0.4067291 -1.8988411 0.9198605 -0.0204133 0.7006613 -0.7921224 0.0168753 -0.0284839 0.0355626 -0.3997908 0.1644408 -0.0379095 -0.0099509 -0.0002472 0.1806004 -0.0108126 -0.0212561 -0.0172404 0.2953374 0.3226071 0.2014558 0.0226772 0.1820337 -0.0143656 0.0072987 0.0319666 0.0103542 -0.0825926 -0.070574 -0.0830738 -0.0077621 -0.0193385 -0.0413289 -0.0093097 -0.0076443 -0.0159789 0.0928159 -0.0884426 -0.0218017 -0.0062883 0.1356707 -0.1130735 -0.0029875 -0.0078672 -0.0064905 0.1143479 -0.0200915 -0.0532003 0.0950177 -0.0006166 0.0185592 -0.0119762 0.0999295 0.0066644 -0.0315848 0.0053964 0.1224187 -0.0024551 0.0994173 -0.0858023 -0.0005911 -0.0021965 0.0050352 0.0891005 0.0057469 -0.0512148 -0.095412 0.0055177 0.0140006 0.0125495 -0.0943702 -0.0095292 -0.056388 0.0925072 -0.0713895 -0.0011514 -0.1369322 0.0000135 -0.0044383 -0.0040593 -0.0025077 0.0867308 -0.0439411 0.0840361 0.0336972 0.0391411 0.0382284 -0.0952479 0.0840937 -0.1006364 -0.053885 -0.0405181 0.0802879 -0.0285328 0.0363197 0.0292427 0.1012579 -0.0798788 0.1085245 -0.0505536 0.7836849 -0.6869052 -0.0113189 -0.9347282 0.8244096 -0.0103029 -0.02685 0.0010654 0.1652521 -0.2612382 0.2773634 0.0238847 0.0825494 -0.0218096 0.0248924 0.000973 0.0440218 -0.1803033 -0.1373161 0.0298444 0.0054309 0.2456441 -0.3044221 0.0082695 0.0238771 -0.0118629 -0.1547057 0.1859159 -0.0494227 0.0214066 0.117284 0.0882188 0.032642 0.045036 0.0157076 -0.1052657 0.0744655 -0.0190987 -0.0078191 -0.0360668 -0.1317832 -0.0316011 -0.009388 -0.0245477 0.1240196 0.1123432 0.0802556 0.0304414 -0.0417704 0.2181842 0.0327898 0.0110614 0.0454725 -0.1088598 0.0672478 -0.0678337 -0.0152462 -0.0482526 0.1489799 -0.0030073 -0.0165195 -0.0001218 0.1339071 -0.1692577 -0.0582992 -0.0084464 -0.0655115 -0.1181656 -0.0025526 -0.0094982 -0.0027883 -0.1546503 -0.1345295 -0.0312403 -0.026841 -0.0549963 0.0619876 -0.0118007 -0.029671 -0.0094679 0.118425 0.0578939 -0.0586058 -0.0121337 -0.0295396 -0.1262821 -0.0302116 -0.0073172 -0.0331172 0.1160442 -0.0339002 0.1109554 -0.0026141 0.1114104 -0.040295 -0.0090798 -0.0024858 -0.0082006 0.1297308 unknown
polarizability: 190.7535388|-40.7742605|170.4847194|6.320416|7.748614|58.8600611 unknown
InChI: InChI=1/C10H12NO/c1-8(2)10(12)11-9-6-4-3-5-7-9/h3-7,11H,1-2H3
charge 0 multiplicity 2
24 atoms
C  -0.14016679 -0.53255963 0.03682865
O  -0.78493637 -1.58594985 -0.06571715
N  1.24654797 -0.51027188 0.11534134
H  1.68013725 0.39674172 0.21695817
C  -0.79120212 0.77809176 0.08078634
C  -0.02161603 2.06347543 0.16225287
C  -2.28075988 0.83054556 0.03609845
H  0.68081178 2.18123745 -0.67717848
H  -0.69556204 2.92522125 0.14357197
H  0.56983947 2.13631432 1.08878139
H  -2.71414592 -0.17042475 0.00003305
H  -2.678966 1.36082794 0.9147276
H  -2.62592051 1.3967862 -0.84302685
C  2.15554809 -1.58085059 0.09179309
C  3.51827529 -1.26651113 0.25354269
C  1.78158663 -2.92417928 -0.08973076
C  4.48485186 -2.26702587 0.22997459
H  3.81580303 -0.22950481 0.40033191
C  2.76414335 -3.91458207 -0.11010708
H  0.73749987 -3.17267208 -0.21065511
C  4.11525227 -3.60203973 0.04708475
H  5.53096565 -2.00004846 0.35617982
H  2.46003535 -4.94862056 -0.25253055
H  4.8689538 -4.38422396 0.0286603
