program: Gaussian 09
title: TitleCard Required
version: ES64L-G09RevD.01
method: RB3LYP
basis: Gen
operation: Freq
keyword: #PGeom=AllCheck
keyword: Guess=TCheck
keyword: SCRF=Check
keyword: GenChk
keyword: RB3LYP/ChkBas
keyword: Freq
title: Title Card Required
converged: YES YES YES YES
title: Mulliken charges:
elementType: C O O O Cs H
charge: 0.615318 -0.640030 -0.632130 -0.615612 0.884164 0.388290
chargesum: 0.00000
title: Mulliken charges with hydrogens summed into heavy atoms:
elementType: C O O O Cs
charge: 0.615318 -0.640030 -0.243839 -0.615612 0.884164
polarizability: 1.78152653e+01 3.22400079e+00 3.95197193e+01 -3.84541382e+00 -2.20347841e+00 3.09399447e+01
1716.lowfreq: -44.4883 0.0001 0.0007 0.0012 8.9344 16.1388 59.0319 116.0231 125.1321
frequency: 53.7354 115.6009 125.0759 549.3033 563.5338 659.4565 817.7314 949.0841 1228.9662 1370.6200 1773.5657 3718.8481
redmass: 10.3472 11.4858 17.9703 1.1027 4.9371 12.3903 12.4494 13.6582 1.3064 13.5863 7.9342 1.0643
irintensity: 16.0536 9.3463 34.3456 105.8277 15.0897 2.9004 36.9434 151.9625 166.3475 458.0179 583.6455 22.2083
temp: 298.150 k
press: 1.00000 atm
elementType: 6 8 8 8 55 1
symmnumber: 1
zpe: 71330.5 jmol-1
zpe.correction: 0.027168 hartree
zpe.thermalcorrener: 0.032865 hartree
zpe.thermalcorrenthalpy: 0.033810 hartree
zpe.thermalcorrgfe: -0.005260 hartree
zpe.sumelectzpe: -284.601315 hartree
zpe.sumelectthermal: -284.595618 hartree
zpe.sumelectthermalent: -284.594674 hartree
zpe.sumelectthermalfe: -284.633744 hartree
dipole: 1.2110 12.0682 1.1430
dipole: 12.1826
quadrupole: -52.4830 32.6304 -46.4664
quadrupole: -58.6551 -5.0172 -2.4792
quadrupole: -30.3766 54.7367 -24.3601 -58.6551 -5.0172 -2.4792
hfenergy: -284.6284837 hartree
pointgroup: C01 [X(C1H1Cs1O3)]
dipole: 0.476456 4.748 0.4497012 debye
dipolederiv: 0.4395066 0.1949483 -0.4396345 0.2287018 2.1365091 -0.0876263 -0.4249355 0.042457 2.0351206 -0.5946556 0.0184108 0.1603956 0.015076 -1.0802888 -0.2958772 0.157347 -0.3172229 -1.3367595 -0.4618981 -0.1232243 -0.0124833 -0.1459783 -1.5505866 0.0862481 -0.0223578 -0.0050605 -0.3631382 -0.6214009 -0.1118852 0.2412278 -0.1327726 -0.9769697 0.3380165 0.2325394 0.257137 -1.3649405 0.9146966 0.0274348 0.0038052 0.0267544 1.1225178 -0.0138256 0.0043523 -0.0064976 0.8945012 0.3237514 -0.0056844 0.0466892 0.0082188 0.3488182 -0.0269355 0.0530547 0.029187 0.1352164 unknown
polarizability: 17.8152653|3.2240008|39.5197193|-3.8454138|-2.2034784|30.9399447 unknown
InChI: InChI=1/CHO3.Cs/c2-1(3)4;/h2H;/q-2;+2/rCHCsO3/c3-1-2(4-1)5-1/h3H
charge 0 multiplicity 1
6 atoms
C  -5.51533173 1.13729716 0.03219433
O  -5.72274737 1.72466987 1.13047635
O  -5.67552951 -0.2504774 0.04699871
O  -5.18601886 1.62134448 -1.07331898
Cs -5.0961003 4.43890588 -0.0359272
H  -5.92538824 -0.44803499 0.96503379
