program: Gaussian 09
title: Title Card Required
version: ES64L-G09RevD.01
method: RB3LYP
basis: Gen
operation: Freq
keyword: #PGeom=AllCheck
keyword: Guess=TCheck
keyword: SCRF=Check
keyword: GenChk
keyword: RB3LYP/ChkBas
keyword: Freq
converged: YES YES NO YES
title: Mulliken charges:
elementType: C O N H C C C H H H H H H C C C C H C H C H H H C C C C C C H C H C H H H
charge: 0.586763 -0.481376 -0.694248 0.358603 -0.153644 -0.449520 -0.448106 0.160158 0.159956 0.175844 0.159879 0.175087 0.161731 0.325067 -0.208550 -0.171911 -0.144631 0.145484 -0.155346 0.178269 -0.139126 0.142870 0.144071 0.138928 -0.060590 0.045970 -0.001333 -0.142438 -0.145706 -0.142348 0.154450 -0.142163 0.152539 -0.132319 0.149602 0.149372 0.148711
chargesum: 0.00000
title: Mulliken charges with hydrogens summed into heavy atoms:
elementType: C O N C C C C C C C C C C C C C C C C C
charge: 0.586763 -0.481376 -0.335645 -0.153644 0.046437 0.048591 0.325067 -0.063065 0.006358 -0.001762 -0.011275 -0.000198 -0.060590 0.045970 -0.001333 0.012012 0.006834 0.007254 0.007209 0.016393
polarizability: 1.93187869e+02 -1.60802420e+01 2.33773093e+02 -5.61506701e+01 -5.72245342e+01 2.74621238e+02
1716.lowfreq: -4.5088 -2.0283 0.0004 0.0006 0.0007 8.9413 21.9027 30.0811 34.0197
frequency: 21.4336 29.5598 33.5803 51.0876 59.2556 74.3296 109.1446 154.2674 164.1096 220.2040 237.2774 251.4300 255.2073 289.8688 303.7312 319.8319 363.1567 366.3219 418.4384 418.8319 423.4725 486.3130 528.1232 531.3562 563.6638 566.3237 575.6582 631.2583 634.0103 636.0843 645.3920 710.2732 710.4049 740.7955 753.0404 780.0239 780.5664 828.3979 850.5208 864.8477 879.4780 919.6234 933.1330 939.4116 968.4976 969.5743 979.8726 983.5512 999.7978 1009.0989 1014.5422 1015.1879 1052.7230 1058.4849 1063.1963 1112.7492 1124.7664 1158.6732 1191.0861 1198.8931 1200.8628 1212.4435 1219.7778 1222.1100 1245.4217 1288.9830 1323.9187 1330.5539 1359.6209 1365.7504 1374.2228 1419.4525 1438.8809 1488.1110 1489.5101 1507.0336 1511.7231 1522.3941 1531.2707 1542.3943 1548.9088 1584.2501 1627.6037 1654.0449 1658.6753 1664.6374 1769.2873 2327.4527 3061.6588 3064.6139 3133.8128 3137.2930 3149.2840 3154.2824 3175.3215 3188.2715 3190.2853 3198.4712 3198.8273 3207.8183 3213.6476 3215.5224 3220.7693 3271.7894 3560.6203
redmass: 3.9144 5.3680 4.6399 3.9043 4.1349 5.4132 5.2796 4.8512 3.7779 2.0496 3.2757 1.7686 2.5819 1.1467 3.5969 3.7817 6.1346 5.2377 3.0997 2.9873 3.7340 5.8346 4.3708 3.3087 6.7642 5.6622 5.6151 5.5415 5.9945 6.4768 1.1471 2.0476 2.0601 3.7212 5.2516 1.7823 1.6904 5.2188 1.2632 1.2450 4.7382 1.4389 3.8230 1.3846 1.6111 1.3294 1.3520 2.3731 1.2563 1.2650 6.1484 6.2084 1.2898 2.1293 2.1823 1.5945 1.5755 3.1950 2.2586 1.0990 1.1254 1.5023 1.6542 1.1602 3.2466 2.3395 4.1022 3.2149 2.3922 1.7366 2.1303 1.1934 1.1989 2.2170 2.1569 1.0467 1.0454 1.0571 1.0765 2.1581 2.2335 2.0044 5.1363 4.3512 5.4161 5.2691 9.1930 11.9762 1.0338 1.0345 1.1041 1.1039 1.1042 1.1033 1.0884 1.0878 1.0858 1.0926 1.0886 1.0922 1.0975 1.0950 1.0982 1.0923 1.0771
irintensity: 0.0128 0.0536 3.9184 0.0838 0.1867 1.4800 0.8597 2.3486 0.1656 3.6114 2.4978 1.3210 1.4511 1.4702 1.7479 10.3401 8.3851 0.5362 0.0123 0.0406 5.3940 8.5709 4.1491 5.5521 2.1094 6.4314 28.4137 1.1627 0.2009 0.0846 49.7908 30.4281 20.7177 3.2449 0.7766 53.7180 48.2494 1.9413 0.1444 0.0148 2.2565 7.7671 36.4160 3.5990 1.8205 0.0442 0.0020 2.9965 1.1521 0.0705 0.3300 0.5787 0.4349 3.0546 3.3284 6.4143 22.5312 1.0266 51.8294 0.0025 3.2101 11.4547 8.2970 5.6106 5.8779 75.7781 29.2036 0.0990 106.6528 0.7314 2.8216 3.4961 3.6724 6.6214 113.6450 1.9186 1.3546 19.2828 8.4489 23.3688 108.6061 518.7897 2.1087 73.4047 7.4820 45.8459 354.5282 0.3059 26.9601 20.7607 21.8102 32.4105 4.3708 26.0689 11.6822 2.2535 0.7506 29.8993 4.0282 22.9151 27.6903 28.5322 12.3041 2.8895 142.5843
temp: 298.150 k
press: 1.00000 atm
elementType: 6 8 7 1 6 6 6 1 1 1 1 1 1 6 6 6 6 1 6 1 6 1 1 1 6 6 6 6 6 6 1 6 1 6 1 1 1
symmnumber: 1
zpe: 799856.2 jmol-1
zpe.correction: 0.304649 hartree
zpe.thermalcorrener: 0.322742 hartree
zpe.thermalcorrenthalpy: 0.323687 hartree
zpe.thermalcorrgfe: 0.256029 hartree
zpe.sumelectzpe: -825.830104 hartree
zpe.sumelectthermal: -825.812011 hartree
zpe.sumelectthermalent: -825.811067 hartree
zpe.sumelectthermalfe: -825.878724 hartree
dipole: 1.1564 1.9062 -3.5741
dipole: 4.2125
quadrupole: -110.4845 -107.0060 -100.9728
quadrupole: 1.0359 -7.2849 -4.5991
quadrupole: -4.3301 -0.8516 5.1817 1.0359 -7.2849 -4.5991
hfenergy: -826.1347535 hartree
pointgroup: C01 [X(C18H17N1O1)]
dipole: 0.4549653 0.7499711 -1.4061608 debye
polarizability: 193.1878687|-16.080242|233.7730934|-56.1506701|-57.2245342|274.6212382 unknown
InChI: InChI=1/C18H17NO/c1-18(2,14-13-15-9-5-3-6-10-15)17(20)19-16-11-7-4-8-12-16/h3-12,19H,1-2H3
charge 0 multiplicity 1
37 atoms
C  0.15018508 -0.11962409 0.24331409
O  -0.19387036 -0.66394922 1.28659637
N  1.20897306 -0.50322022 -0.52713557
H  1.36349661 0.05569726 -1.35900846
C  -0.66882067 1.09997934 -0.28880792
C  -0.69254224 2.16341043 0.83568697
C  -2.10625014 0.58879318 -0.56145863
H  0.31284641 2.54965096 1.03400568
H  -1.33530783 3.0016076 0.54813336
H  -1.08031333 1.71135916 1.7525002
H  -2.1128006 -0.15841737 -1.36197829
H  -2.50579848 0.13159519 0.34813536
H  -2.75189701 1.42123168 -0.85880307
C  2.11490232 -1.56678455 -0.33485512
C  3.09646359 -1.75103509 -1.32375869
C  2.08094005 -2.42583632 0.77494046
C  4.03054714 -2.77669175 -1.2058834
H  3.12330172 -1.08495362 -2.18409612
C  3.02423095 -3.44971938 0.87704361
H  1.32583792 -2.28514622 1.53518758
C  4.00082325 -3.63470004 -0.10328872
H  4.78333818 -2.90391918 -1.97931843
H  2.98931486 -4.10994013 1.73979207
H  4.72934293 -4.43517333 -0.01068202
C  -0.10877554 1.68319629 -1.51356371
C  0.35021216 2.16440336 -2.52993905
C  0.89621032 2.72730192 -3.72533413
C  1.58686834 3.9546269 -3.68667007
C  0.75073613 2.06113145 -4.95844183
C  2.11740425 4.49792754 -4.85485766
H  1.7003491 4.47083344 -2.73807941
C  1.28595841 2.61151598 -6.1210516
H  0.21711265 1.11583977 -4.99205487
C  1.96929129 3.82997228 -6.07380749
H  2.64756669 5.44551134 -4.8139587
H  1.16771713 2.08898453 -7.06639789
H  2.38480938 4.25687213 -6.98249384
