program: Gaussian 09
title: Title Card Required
version: ES64L-G09RevD.01
method: RB3LYP
basis: Gen
operation: Freq
keyword: #P
keyword: Geom=AllCheck
keyword: Guess=TCheck
keyword: SCRF=Check
keyword: GenChk
keyword: RB3LYP/ChkBas
keyword: Freq
converged: YES YES YES YES
title: Mulliken charges:
elementType: Cs Br
charge: 0.943772 -0.943772
chargesum: 0.00000
title: Mulliken charges with hydrogens summed into heavy atoms:
polarizability: 3.82046820e+01 3.05954037e-09 2.09851953e+01 1.55038178e-08 4.62654405e-09 2.09851953e+01
1716.lowfreq: 0.0001 0.0001 0.0005 25.0363 25.0363 77.1490
frequency: 77.1490
redmass: 92.9916
irintensity: 19.4027
temp: 298.150 k
press: 1.00000 atm
elementType: 55 35
symmnumber: 1
zpe: 461.5 jmol-1
zpe.correction: 0.000176 hartree
zpe.thermalcorrener: 0.003316 hartree
zpe.thermalcorrenthalpy: 0.004260 hartree
zpe.thermalcorrgfe: -0.026972 hartree
zpe.sumelectzpe: -33.653152 hartree
zpe.sumelectthermal: -33.650013 hartree
zpe.sumelectthermalent: -33.649069 hartree
zpe.sumelectthermalfe: -33.680300 hartree
dipole: 16.6906 0.0000 0.0000
dipole: 16.6906
quadrupole: -155.7016 -37.1109 -37.1109
quadrupole: 4.1656 0.0545 0.0000
quadrupole: -79.0604 39.5302 39.5302 4.1656 0.0545 0.0000
hfenergy: -33.6533282 hartree
pointgroup: C*V [C*(Br1Cs1)]
dipole: 6.56658 0. 0. debye
dipolederiv: 0.9927245 0. 0. 0. 0.966106 0. 0. 0. 0.966106 -0.9927245 0. 0. 0. -0.966106 0. 0. 0. -0.966106 unknown
polarizability: 38.204682|0.|20.9851953|0.|0.|20.9851953 unknown
InChI: InChI=1/BrH.Cs/h1H;/q;+1/p-1
charge 0 multiplicity 1
2 atoms
Cs -1.76761337 0.249576 0.003267
Br -5.36347663 0.249576 0.003267
